program: Gaussian 09
title: 000068840
version: EM64L-G09RevD.01
frameworkgroup: C1[X(C17H19N)]
method: RPBEPBE
basis: SDD
operation: Freq
keyword: #pfreq=noraman
keyword: PBEPBE/SDD
title: #p freq=noraman PBEPBE/SDD
converged: YES YES NO NO
title: Mulliken charges:
elementType: N C C C C C C C C C C C C C C C C C H H H H H H H H H H H H H H H H H H H
charge: -0.542982 0.265769 0.068136 -0.519794 0.287725 0.284618 -0.581172 -0.716146 -0.402699 -0.402600 -0.402404 -0.400417 -0.236906 -0.239655 -0.225085 -0.225066 -0.248864 -0.249447 0.199516 0.254815 0.265419 0.220393 0.221741 0.216499 0.227732 0.246935 0.245613 0.249217 0.248852 0.265389 0.268831 0.225966 0.225071 0.224477 0.224554 0.228123 0.227848
chargesum: 0.00000
title: Mulliken charges with hydrogens summed into heavy atoms:
elementType: N C C C C C C C C C C C C C C C C C
charge: -0.008762 0.265769 0.068136 -0.065463 0.287725 0.284618 -0.095361 -0.050174 -0.155764 -0.156987 -0.153187 -0.151565 -0.010940 -0.014584 -0.000608 -0.000511 -0.020742 -0.021599
polarizability: 2.25473793e+02 -5.44047038e-01 2.20650218e+02 -1.57763870e+01 -1.10566611e+00 1.39412029e+02
1716.lowfreq: -17.7254 -10.3342 -5.6683 -0.0007 0.0002 0.0008 29.7294 44.6709 59.1919
frequency: 27.8113 44.3455 59.0127 63.6696 70.6516 92.0168 95.3687 141.5913 205.9677 235.6893 239.0829 252.5914 277.2439 292.2650 303.4720 319.4202 344.0247 406.0460 409.0066 451.3186 493.0586 518.7083 553.7003 610.3605 614.3598 616.5585 626.4834 665.6438 689.9847 707.0819 707.6575 761.2596 776.4250 789.4287 824.9732 855.0538 858.1123 888.2568 894.2550 928.7395 931.6239 978.1894 979.6463 980.7549 988.7672 989.8025 994.1972 995.0767 1024.6347 1029.7896 1038.6708 1062.6879 1072.8774 1079.8192 1084.7141 1125.2379 1170.6350 1170.9702 1184.9519 1187.8542 1189.1952 1205.5613 1262.1715 1289.1833 1309.4680 1314.3196 1322.3328 1325.0883 1346.4018 1368.8573 1373.6276 1381.2733 1431.4012 1431.7489 1455.6405 1466.3249 1475.6682 1476.3370 1481.3890 1485.7087 1578.6721 1579.1917 1600.2990 1605.4271 1608.0724 1636.9149 2970.4277 2977.3441 2994.6561 3056.0257 3072.9734 3077.7094 3082.0746 3119.9582 3120.3684 3125.5455 3125.7490 3138.7169 3139.0302 3146.5701 3146.7545 3162.7013 3162.9437 3451.4918 3581.1936
redmass: 3.2897 3.7157 3.2782 4.0260 4.0463 3.2200 2.9195 3.0635 1.3204 4.1112 3.9443 1.3636 3.1532 3.1492 2.2742 2.6253 2.6198 2.8576 2.8746 4.0303 3.0366 2.2322 2.1128 3.8484 4.8563 5.8251 4.2526 3.8628 3.8322 1.6828 1.6541 2.0769 1.6964 1.6301 2.0886 1.2478 1.2453 1.7197 3.4043 1.4728 1.5433 1.3958 1.4254 1.9316 5.7447 5.5684 1.3304 1.3222 2.3779 2.0099 2.3365 1.8494 2.3150 1.6010 2.0223 1.4813 1.0532 1.0527 1.7517 1.2957 1.2596 3.0636 1.2905 2.9730 1.3760 1.4266 1.3542 1.2715 1.2211 6.5478 6.9554 1.2085 2.2708 2.2647 1.0712 1.0858 1.0665 2.0883 2.3681 1.0642 5.9478 5.9180 8.1167 6.0826 6.0997 1.0933 1.0672 1.0357 1.0648 1.0945 1.0968 1.0986 1.0987 1.0843 1.0843 1.0872 1.0874 1.0921 1.0921 1.0964 1.0965 1.1016 1.1015 1.0443 1.0979
irintensity: 0.0448 0.2441 0.3739 0.0497 0.2408 1.4858 0.2070 0.1521 0.8146 1.0199 0.2007 23.7407 6.3267 2.8364 9.4510 9.2011 3.8947 0.2945 0.2182 11.0550 24.3417 50.4936 88.1162 108.9898 64.5763 23.4362 50.6101 9.9992 23.5893 54.7111 57.2654 18.7036 27.6071 36.7473 4.3062 0.1026 0.0926 4.7920 1.5440 0.9167 4.3580 0.7960 1.4114 6.2790 0.1753 0.3984 0.0919 0.4831 7.7143 14.0329 9.4917 2.7260 11.8838 12.5743 6.3682 7.3209 0.0089 0.0052 0.1528 1.2804 0.1287 2.6191 2.3822 3.1702 0.3897 2.2910 4.5651 2.6606 1.7009 1.5657 0.1217 12.2600 10.5438 5.2704 7.3209 7.7115 6.1843 10.2220 24.6607 5.9274 0.8026 2.3152 9.4017 8.9014 3.6237 27.2286 32.5442 37.6731 37.4024 2.8596 31.9271 28.6291 46.2876 4.2489 3.5047 0.1854 0.5986 17.6963 14.2439 29.3397 50.4987 34.7987 18.1779 3.0340 0.6172
temp: 298.150 k
press: 1.00000 atm
elementType: 7 6 6 6 6 6 6 6 6 6 6 6 6 6 6 6 6 6 1 1 1 1 1 1 1 1 1 1 1 1 1 1 1 1 1 1 1
symmnumber: 1
zpe: 816057.2 jmol-1
zpe.correction: 0.310820 hartree
zpe.thermalcorrener: 0.328051 hartree
zpe.thermalcorrenthalpy: 0.328995 hartree
zpe.thermalcorrgfe: 0.264800 hartree
zpe.sumelectzpe: -712.641570 hartree
zpe.sumelectthermal: -712.624339 hartree
zpe.sumelectthermalent: -712.623395 hartree
zpe.sumelectthermalfe: -712.687590 hartree
dipole: 1.2631 -0.1108 0.0759
dipole: 1.2702
quadrupole: -103.4228 -103.4941 -104.1489
quadrupole: 6.2441 -6.4513 0.9841
quadrupole: 0.2658 0.1945 -0.4603 6.2441 -6.4513 0.9841
hfenergy: -712.9523899 hartree
pointgroup: C01 [X(C17H19N1)]
dipole: -0.4929193 -0.0474622 0.0672397 debye
polarizability: 216.2570838|0.424603|220.6702227|-30.9361994|0.0385058|148.6087336 unknown
InChI: InChI=1S/C17H19N/c1-2-14(13-18)17(15-9-5-3-6-10-15)16-11-7-4-8-12-16/h3-12H,2,13,18H2,1H3
charge 0 multiplicity 1
37 atoms
N  1.287895 3.571336 1.096002
C  -0.043279 1.712434 -0.001993
C  -0.023238 0.329835 0.001275
C  -1.33967 2.522771 0.004772
C  1.232355 -0.459307 -0.239956
C  -1.255424 -0.497776 0.241165
C  1.242919 2.560739 0.013768
C  -1.416778 3.533801 -1.172477
C  2.098507 -0.15819 -1.32802
C  -2.098846 -0.258608 1.361715
C  1.56472 -1.566489 0.590548
C  -1.582946 -1.579695 -0.622686
C  3.266498 -0.916194 -1.563042
C  -3.239663 -1.055941 1.599509
C  2.73472 -2.321805 0.361977
C  -2.727653 -2.37311 -0.392579
C  3.593801 -1.999292 -0.715519
C  -3.563546 -2.114549 0.719559
H  -1.445435 3.081562 0.95736
H  -2.208138 1.846891 -0.056592
H  2.124665 1.909573 0.126741
H  1.374112 3.100453 -0.943726
H  -2.392105 4.053835 -1.165512
H  -0.626904 4.305288 -1.117779
H  -1.314216 3.014798 -2.142749
H  1.83576 0.660792 -2.007434
H  -1.839901 0.545423 2.060323
H  0.90013 -1.827521 1.421966
H  -0.934002 -1.791685 -1.480018
H  1.23367 3.170502 2.037994
H  0.640664 4.356636 0.976292
H  3.915116 -0.666717 -2.410554
H  -3.870054 -0.856877 2.473815
H  2.976009 -3.16287 1.022067
H  -2.966407 -3.194325 -1.078106
H  4.499452 -2.589222 -0.895987
H  -4.44859 -2.734499 0.90178
