program: Gaussian 09
title: 000007547
version: EM64L-G09RevD.01
frameworkgroup: C1[X(C13H9Cl3N2O)]
method: RPBEPBE
basis: SDD
operation: Freq
keyword: #p
keyword: freq=noraman
keyword: PBEPBE/SDD
title: #p freq=noraman PBEPBE/SDD
converged: YES YES NO NO
title: Mulliken charges:
elementType: Cl Cl Cl O N N C C C C C C C C C C C C C H H H H H H H H H
charge: -0.015213 -0.008625 -0.058202 -0.282018 -0.510988 -0.503743 0.526213 0.491137 -0.458137 -0.335653 0.282479 -0.438307 -0.312897 -0.027868 -0.179175 -0.123525 -0.184313 -0.197687 -0.122399 0.296711 0.293250 0.248478 0.316245 0.222034 0.312138 0.258267 0.256022 0.255776
chargesum: 0.00000
title: Mulliken charges with hydrogens summed into heavy atoms:
elementType: Cl Cl Cl O N N C C C C C C C C C C C C C
charge: -0.015213 -0.008625 -0.058202 -0.282018 -0.214277 -0.210493 0.526213 0.491137 -0.209659 -0.019409 0.282479 -0.216273 -0.000759 -0.027868 0.079092 -0.123525 0.071710 0.058089 -0.122399
polarizability: 3.80959452e+02 -7.41831988e-01 1.79160317e+02 -4.50216163e-03 2.46355555e-03 6.82664152e+01
1716.lowfreq: -3.9856 -0.0031 -0.0030 -0.0028 1.9070 10.9128 19.5574 25.8962 47.1469
frequency: 19.3298 25.5798 47.1460 57.2995 71.9049 113.9004 136.6026 136.6603 163.0294 186.5528 191.7187 237.4073 293.9092 306.1519 321.5161 338.2251 373.1662 405.3928 411.6360 435.9831 437.4323 452.4114 478.8606 514.7411 578.0428 610.4110 616.0093 623.7346 659.2577 687.5088 697.0412 700.9168 703.2642 777.7321 811.0515 820.0555 833.5652 845.9893 856.3515 890.3083 935.0435 975.9021 980.8255 992.6972 995.0602 1011.5125 1075.9360 1118.2725 1123.1127 1146.4344 1179.8034 1187.4624 1237.5652 1260.5821 1290.3624 1298.5492 1345.1277 1367.0500 1394.3122 1402.0878 1466.5017 1480.4668 1503.9798 1510.5124 1581.9711 1597.7379 1605.6318 1608.9952 1653.6018 3117.7230 3139.6717 3166.8185 3167.0989 3172.3975 3199.8330 3206.3936 3522.2153 3533.8339
redmass: 11.2120 5.2210 11.3690 7.2792 7.6371 6.1107 4.7441 11.0800 14.5122 5.0767 19.6554 10.1107 9.8616 3.3120 5.8764 9.5221 6.4891 10.4854 3.0270 2.7005 6.7156 1.8624 9.3740 2.5659 3.8643 7.6851 1.2778 7.1739 7.3980 3.1931 7.6383 7.6165 3.9724 7.2245 1.4042 6.5046 1.3310 1.3997 1.6446 5.9656 1.3546 1.3090 1.3118 4.4255 5.6345 5.7628 2.5866 1.3489 2.1910 1.3571 2.5844 1.1145 1.5447 1.8961 1.8549 1.5970 3.6317 5.3756 5.5181 4.2173 2.9029 2.4086 2.3301 2.2358 4.8978 5.6376 6.5722 6.1664 3.8271 1.0901 1.0923 1.0914 1.0911 1.0951 1.0951 1.0950 1.0767 1.0757
irintensity: 0.8644 0.6220 0.6593 0.0899 11.8128 0.0630 0.4268 3.4955 1.1529 1.6645 0.0311 0.2531 6.9347 0.1363 0.0049 11.9873 2.9749 31.7661 0.0086 5.4249 7.1991 6.5990 5.5708 40.2555 27.6033 26.0640 114.2947 0.3724 4.0814 10.5374 17.9168 21.8047 0.5611 0.9087 42.3207 11.4264 8.0646 53.0067 85.9051 11.3045 1.0876 2.4826 4.4561 38.1673 27.3957 2.7225 60.6787 25.1527 85.3797 2.7022 334.6526 0.7707 95.8399 119.3649 35.5316 9.9294 111.5852 306.9035 8.2742 18.1416 495.3388 195.0739 672.7724 398.4081 133.2873 37.9740 94.1702 1.6354 101.5505 17.5106 6.2586 2.1555 1.4440 2.6180 10.4040 12.0132 6.0356 19.3285
temp: 298.150 k
press: 1.00000 atm
elementType: 17 17 17 8 7 7 6 6 6 6 6 6 6 6 6 6 6 6 6 1 1 1 1 1 1 1 1 1
symmnumber: 1
zpe: 504949.0 jmol-1
zpe.correction: 0.192325 hartree
zpe.thermalcorrener: 0.209719 hartree
zpe.thermalcorrenthalpy: 0.210663 hartree
zpe.thermalcorrgfe: 0.143903 hartree
zpe.sumelectzpe: -2064.378881 hartree
zpe.sumelectthermal: -2064.361487 hartree
zpe.sumelectthermalent: -2064.360543 hartree
zpe.sumelectthermalfe: -2064.427303 hartree
dipole: 1.0819 3.9346 0.0006
dipole: 4.0806
quadrupole: -169.4633 -114.9022 -136.1254
quadrupole: 7.9316 0.0009 0.0013
quadrupole: -29.2997 25.2614 4.0383 7.9316 0.0009 0.0013
hfenergy: -2064.5712062 hartree
pointgroup: C01 [X(C13H9Cl3N2O1)]
dipole: 0.4601847 1.5380617 0.0002414 debye
polarizability: 380.8251137|-5.2575232|179.2946553|-0.0044459|0.0025637|68.2664152 unknown
InChI: InChI=1S/C13H9Cl3N2O/c14-8-1-3-9(4-2-8)17-13(19)18-10-5-6-11(15)12(16)7-10/h1-7,17-18H
charge 0 multiplicity 1
28 atoms
Cl -5.901851 1.99647 0.000003
Cl -6.619999 -1.226562 0.000165
Cl 7.346533 -0.580905 -0.000205
O  0.375595 -1.262907 0.000197
N  -0.879081 0.735342 0.000364
N  1.45252 0.834688 0.00029
C  -2.202775 0.220451 0.000304
C  2.820177 0.43964 0.00018
C  -3.260828 1.168573 0.000185
C  -2.509973 -1.16736 0.000381
C  0.323259 0.000036 0.000335
C  3.793793 1.475793 0.000252
C  3.243457 -0.916547 -0.000007
C  -4.599018 0.737357 0.000149
C  -3.856937 -1.5783 0.000334
C  -4.907998 -0.638455 0.000218
C  5.169835 1.173049 0.000134
C  4.621823 -1.218671 -0.00012
C  5.568266 -0.177593 -0.000053
H  -0.816369 1.755467 0.000356
H  1.3030 1.845889 0.000393
H  -3.052926 2.244428 0.000117
H  -1.701961 -1.899069 0.000459
H  3.481013 2.527974 0.0004
H  2.499912 -1.714512 -0.000048
H  -4.098587 -2.645184 0.000388
H  5.914168 1.97416 0.000189
H  4.949954 -2.26205 -0.000261
