program: Gaussian 09
title: 000068830
version: EM64L-G09RevD.01
frameworkgroup: C1[X(C13H8N2O3)]
method: RPBEPBE
basis: SDD
operation: Freq
keyword: #p
keyword: freq=noraman
keyword: PBEPBE/SDD
title: #p freq=noraman PBEPBE/SDD
converged: YES YES YES YES
title: Mulliken charges:
elementType: O O O N N C C C C C C C C C C C C C H H H H H H H H
charge: -0.243341 -0.443835 -0.244201 -0.274161 -0.034166 0.126552 0.060042 0.137427 0.181936 -0.457324 -0.333780 0.258517 -0.114844 -0.310087 -0.306604 -0.235623 -0.164569 0.099808 0.305674 0.265657 0.295593 0.274273 0.280947 0.240395 0.249799 0.385914
chargesum: 0.00000
title: Mulliken charges with hydrogens summed into heavy atoms:
elementType: O O O N N C C C C C C C C C C C C C
charge: -0.243341 -0.057921 -0.244201 -0.274161 -0.034166 0.126552 0.060042 0.137427 0.181936 -0.151650 -0.068123 0.258517 0.180749 -0.035814 -0.025656 0.004772 0.085230 0.099808
polarizability: 3.37819335e+02 8.51742815e+00 1.72130552e+02 4.35728585e-03 -3.52826871e-03 6.10703558e+01
1716.lowfreq: -11.7803 -8.8052 -0.0005 0.0002 0.0006 2.5233 47.4053 57.3884 97.5477
frequency: 47.4029 57.3879 97.5466 124.7390 151.4881 157.9400 244.0557 255.8890 276.4430 327.4769 333.6934 407.3661 427.6612 463.1172 464.6226 489.6234 505.5132 536.5000 563.0791 586.0356 604.7958 613.1679 641.0344 678.7806 684.5717 719.7868 736.5266 750.0674 778.3816 798.8455 845.1375 867.3554 871.8944 872.3591 944.9015 975.9153 977.0391 997.1668 1005.2638 1016.2493 1030.5387 1069.9892 1108.0173 1127.7380 1140.3573 1160.2450 1201.9545 1231.9269 1244.9748 1278.2323 1291.5164 1319.9867 1370.7257 1392.4944 1424.7692 1438.3731 1476.2039 1513.5315 1538.9664 1552.4491 1613.4674 1623.7742 1647.2375 1651.4935 3157.7796 3162.3958 3163.9879 3177.1755 3185.3850 3191.7084 3198.6643 3532.4967
redmass: 7.3289 10.0927 4.5774 8.0002 5.7531 6.0151 6.3376 5.5222 8.3316 6.5907 8.8493 3.3793 7.1323 3.5338 7.4162 6.9404 2.9275 9.3444 2.6511 5.7353 1.4488 6.3930 6.1985 4.6146 6.5405 4.5369 6.5517 5.2316 1.4251 3.7532 7.0453 1.6095 6.4889 1.4320 6.4838 1.3249 1.4821 1.3146 1.3493 2.2621 2.9718 3.8251 1.8349 1.7730 1.5646 1.3580 2.6656 1.5859 2.1866 1.9280 3.0122 2.5903 1.9665 6.4546 3.0313 3.0522 3.9497 6.5157 7.5739 7.9705 6.9234 8.2115 8.2817 8.0435 1.0890 1.0925 1.0887 1.0893 1.0974 1.0961 1.1012 1.0642
irintensity: 2.2468 1.2455 1.9013 0.9881 0.2099 0.5545 0.9264 0.5644 3.1223 7.3027 5.5736 6.9776 0.1560 4.1202 16.7955 17.9040 9.5346 0.6258 53.4756 45.4036 54.0606 2.6590 4.7065 76.7237 11.1116 7.2272 2.2732 7.7866 100.7514 0.0091 2.3660 35.8311 2.4664 0.4148 73.8291 0.7030 13.0199 0.4537 0.0524 37.6163 308.2294 5.5620 143.3444 50.3407 72.0643 47.3546 27.9275 8.6814 0.8969 25.3757 5.0585 188.0022 85.6041 3.4662 55.4453 8.8529 106.5165 389.3069 51.6620 5.5726 326.9840 100.0687 279.0555 153.5582 9.7244 2.0742 1.2695 4.4928 3.7843 0.2048 12.2886 63.5553
temp: 298.150 k
press: 1.00000 atm
elementType: 8 8 8 7 7 6 6 6 6 6 6 6 6 6 6 6 6 6 1 1 1 1 1 1 1 1
symmnumber: 1
zpe: 485177.7 jmol-1
zpe.correction: 0.184794 hartree
zpe.thermalcorrener: 0.198183 hartree
zpe.thermalcorrenthalpy: 0.199128 hartree
zpe.thermalcorrgfe: 0.144267 hartree
zpe.sumelectzpe: -834.168239 hartree
zpe.sumelectthermal: -834.154850 hartree
zpe.sumelectthermalent: -834.153906 hartree
zpe.sumelectthermalfe: -834.208767 hartree
dipole: 3.8856 -2.5438 0.0001
dipole: 4.6442
quadrupole: -70.3042 -110.7235 -105.1634
quadrupole: 9.4672 0.0010 0.0002
quadrupole: 25.0929 -15.3265 -9.7664 9.4672 0.0010 0.0002
hfenergy: -834.3530338 hartree
pointgroup: C01 [X(C13H8N2O3)]
dipole: 1.5344576 -0.9919931 0.0000276 debye
dipolederiv: -0.3832032 0.0021025 -0.0000025 -0.0476544 -1.2017997 0.00004 0.0000071 -0.0000151 -0.3427201 -1.3233672 -0.4842718 -0.0000342 -0.6761516 -0.6213066 -0.0000406 -0.0002471 -0.0001546 -0.4290905 -1.019814 0.2399866 -0.000019 0.5051049 -0.907871 -0.0000917 -0.0001854 0.000149 -0.3269712 -0.3442843 0.5544636 -0.0000155 -0.4226225 -0.6024586 0.0000102 0.0000087 0.0000198 0.0033129 -1.9351714 -0.0721768 -0.0000166 -0.3122924 -0.3842238 -0.000002 0.0000051 -0.0000039 -0.2634554 -0.4510409 -0.3067623 0.0000034 0.2330932 -0.4283554 0.0000076 -0.0000148 0.0000178 -0.0342782 1.4851658 -0.0858914 0.0000121 -0.2274369 0.1875925 -0.0000093 0.0000228 0.0000006 0.0905539 1.3560335 0.2582245 0.0000075 0.9401527 0.4342523 0.0000001 -0.0000073 -0.0000018 0.123717 0.7162899 -0.1912734 0.0000061 0.0042966 1.4860218 -0.0000421 -0.0000238 0.0000031 0.1996351 0.3439041 0.146844 -0.0000078 -0.008931 0.0062635 0.0000006 0.0000793 -0.0000142 -0.0517825 -0.8251549 0.0036947 -0.0000057 -0.1331725 0.1645866 -0.0000089 0.0000194 -0.0000089 -0.1653808 -1.0870178 -0.0566049 -0.0000431 0.3919722 -0.2247224 0.0000234 -0.0000265 -0.0000096 -0.0159925 -0.0537004 -0.2249132 0.0000101 0.2347058 -0.0166894 0.0000008 -0.0000096 -0.0000089 -0.0298532 -0.7257473 -0.153962 -0.0000004 -0.1170182 0.0566018 -0.0000079 -0.0000063 -0.0000091 -0.1623469 0.4197054 0.0218786 -0.0000013 -0.3814935 0.1799764 -0.0000122 0.0000672 -0.0000127 -0.0952724 0.1360294 0.3273195 -0.0000046 -0.3156927 -0.1236336 -0.000004 0.0000171 0.0000073 -0.1869171 0.2780116 -0.1044368 0.0000118 0.4425825 0.2720042 -0.000007 -0.0000098 -0.0000162 -0.09092 2.6737738 0.0410873 0.0001406 -0.2512467 1.2532994 0.0000962 0.0003581 0.0000102 0.2298002 0.1221602 -0.0101344 0.000001 0.0208925 0.0572176 0.0000025 0.0000032 0.0000014 0.1521497 0.0824597 0.0524366 -0.0000037 0.0082895 -0.0369414 0.0000064 -0.0000194 0.0000046 0.1580343 0.139339 0.0489487 -0.0000031 -0.0318786 0.0808095 0.0000033 -0.0000027 0.0000038 0.181232 0.0891365 -0.0207527 -0.0000006 0.0340896 -0.0024093 0.0000051 -0.0000032 0.0000055 0.1690782 0.0565255 -0.0787167 0.0000077 -0.0694858 0.0662935 0.0000027 0.0000074 0.0000036 0.1566502 -0.0011215 -0.0763533 -0.0000006 -0.0866254 0.0244843 0.0000029 0. 0.0000032 0.1710147 -0.0671839 0.0716576 -0.000007 0.074927 0.0746198 0.0000048 -0.0000073 0.0000034 0.1588476 0.3182724 0.0976056 -0.0000345 0.1915957 0.2063878 0.000019 -0.0000322 0.0000216 0.400955 unknown
polarizability: 337.7156268|9.4720195|172.2342608|0.0043776|-0.0035031|61.0703558 unknown
InChI: InChI=1S/C13H8N2O3/c16-12-9-7-8(13(17)18)4-5-10(9)14-11-3-1-2-6-15(11)12/h1-7,17H
charge 0 multiplicity 1
26 atoms
O  0.670834 2.481147 -0.000131
O  -5.148268 -0.564762 -0.000353
O  -4.466872 1.656403 -0.000318
N  2.066432 0.578168 -0.000111
N  1.151401 -1.685121 -0.000039
C  -0.372527 0.279159 -0.000096
C  -0.124549 -1.142808 -0.000049
C  2.200747 -0.846933 -0.000071
C  0.743542 1.221312 -0.000152
C  -1.701192 0.772788 -0.000095
C  -1.245458 -2.031995 -0.000018
C  -2.787184 -0.120297 -0.000046
C  3.184255 1.417186 -0.000111
C  3.545146 -1.366996 -0.000017
C  -2.548317 -1.533929 -0.000019
C  4.4633 0.899869 -0.00007
C  4.648599 -0.527406 -0.000019
C  -4.161965 0.439403 -0.000024
H  -1.876037 1.853653 -0.000126
H  -1.039389 -3.10595 0.000015
H  2.941555 2.482526 -0.000149
H  3.632037 -2.455734 0.000019
H  -3.406814 -2.210671 0.000016
H  5.316622 1.581855 -0.000075
H  5.659576 -0.946253 0.000017
H  -6.042474 -0.129612 -0.000581
