program: Gaussian 09
title: 000073812
version: EM64L-G09RevD.01
frameworkgroup: C1[X(C12H13NO2)]
method: RPBEPBE
basis: SDD
operation: Freq
keyword: #p
keyword: freq=noraman
keyword: PBEPBE/SDD
title: #p freq=noraman PBEPBE/SDD
converged: YES YES NO NO
title: Mulliken charges:
elementType: O O N C C C C C C C C C C C C H H H H H H H H H H H H H
charge: -0.201247 -0.201205 -0.218720 -0.351390 -0.349288 0.180055 0.180544 -0.342480 0.083585 0.083746 -0.354472 -0.354510 -0.695001 -0.211645 -0.211677 0.234244 0.234460 0.217259 0.216618 0.199657 0.199649 0.269439 0.269442 0.213982 0.218258 0.213901 0.238397 0.238401
chargesum: 0.00000
title: Mulliken charges with hydrogens summed into heavy atoms:
elementType: O O N C C C C C C C C C C C C
charge: -0.201247 -0.201205 -0.218720 0.117314 0.084588 0.180055 0.180544 0.056826 0.083585 0.083746 -0.085033 -0.085068 -0.048861 0.026752 0.026724
polarizability: 1.93512429e+02 3.17655156e-02 1.49160317e+02 -1.77971346e+01 9.46168250e-02 8.14666540e+01
1716.lowfreq: -7.7568 0.0005 0.0006 0.0007 3.1338 11.0461 28.9320 43.2382 63.1656
frequency: 28.4840 43.2176 63.1519 108.0104 128.1837 138.0937 174.1296 222.1811 224.9849 235.6821 264.8189 294.2211 340.3878 402.4465 432.7182 456.3390 523.1234 531.9517 601.8874 659.1952 676.3981 699.3804 715.7102 734.9480 775.9501 785.5085 795.6152 848.1422 900.6808 906.8972 927.0087 946.6402 974.4304 1005.9780 1012.0047 1028.2073 1029.3624 1072.6412 1072.8225 1114.8134 1167.5987 1170.4694 1187.1374 1202.8102 1248.7573 1273.8121 1283.6260 1291.6973 1331.5746 1335.0874 1347.9475 1372.2451 1391.6149 1415.8567 1446.4466 1453.0595 1455.7074 1469.0228 1476.5031 1478.0822 1487.4699 1614.9939 1617.6592 1627.0306 1675.9258 2968.2711 2975.8921 2987.1911 3012.5656 3014.1034 3045.4804 3072.9351 3076.0857 3083.8397 3139.0381 3152.4960 3164.0415 3174.1483
redmass: 4.1308 4.7883 1.5908 2.3248 5.4977 5.0007 6.4849 1.6039 3.9081 2.1415 2.6853 5.7232 8.4286 2.9672 3.2871 4.8897 7.2095 6.8722 9.7238 4.8051 4.9492 5.6035 3.0818 1.1137 1.4105 4.7307 1.6687 3.1890 1.8016 1.3873 1.4741 6.0803 1.4126 1.3442 2.3485 3.0928 2.2910 2.6576 2.5206 2.3866 1.2051 2.0436 2.0507 2.9291 1.4223 1.2864 1.4892 1.0803 1.2419 3.3287 1.6490 1.5814 1.2180 5.9660 1.2603 2.4618 2.1259 1.0700 1.0661 1.0421 1.0819 7.7030 8.3768 10.8076 11.7247 1.0587 1.0367 1.0590 1.1005 1.0583 1.1036 1.1014 1.0994 1.1058 1.0864 1.0906 1.0956 1.1004
irintensity: 0.2373 1.9257 0.1224 0.1330 6.3523 0.0004 0.7812 0.5150 0.5800 0.0280 2.7584 6.8029 7.9278 3.2140 1.3998 0.0000 9.3805 6.4176 12.1710 0.0101 0.2284 7.3179 74.7723 10.0652 0.2639 0.0454 32.7177 6.8024 3.2391 0.0299 27.1039 14.9519 2.3026 0.0031 1.4284 1.7235 61.3854 9.8676 0.2481 18.7687 7.3373 2.6986 12.2258 15.4706 3.9889 0.7719 0.3554 1.2784 15.1487 234.5934 49.7040 38.8372 12.6984 9.9687 18.5483 11.2241 5.2307 0.2438 4.8258 12.7539 18.2822 1.6829 147.9149 307.5443 44.1473 28.9735 31.2777 24.8465 5.8092 37.1551 9.3883 46.3433 53.0970 31.2308 1.7198 5.2623 6.3905 21.3154
temp: 298.150 k
press: 1.00000 atm
elementType: 8 8 7 6 6 6 6 6 6 6 6 6 6 6 6 1 1 1 1 1 1 1 1 1 1 1 1 1
symmnumber: 1
zpe: 589666.7 jmol-1
zpe.correction: 0.224592 hartree
zpe.thermalcorrener: 0.238431 hartree
zpe.thermalcorrenthalpy: 0.239376 hartree
zpe.thermalcorrgfe: 0.182669 hartree
zpe.sumelectzpe: -669.224266 hartree
zpe.sumelectthermal: -669.210427 hartree
zpe.sumelectthermalent: -669.209483 hartree
zpe.sumelectthermalfe: -669.266189 hartree
dipole: -2.0130 -0.0115 0.8431
dipole: 2.1824
quadrupole: -67.0221 -98.8246 -89.1139
quadrupole: 0.0758 -3.9892 -0.0334
quadrupole: 17.9648 -13.8377 -4.1271 0.0758 -3.9892 -0.0334
hfenergy: -669.4488585 hartree
pointgroup: C01 [X(C12H13N1O2)]
dipole: 0.7945029 0.0177303 -0.3251179 debye
polarizability: 193.7781956|1.1431863|148.9649375|-16.8969858|3.6502039|81.3962668 unknown
InChI: InChI=1S/C12H13NO2/c1-2-3-8-13-11(14)9-6-4-5-7-10(9)12(13)15/h4-7H,2-3,8H2,1H3
charge 0 multiplicity 1
28 atoms
O  -0.315891 2.336197 0.62304
O  -0.305251 -2.366817 0.369871
N  -0.646506 -0.020806 0.583055
C  -2.08153 -0.042289 0.907402
C  -2.976352 0.012776 -0.352177
C  1.50419 0.720587 0.077256
C  1.507389 -0.693824 0.000699
C  -4.478481 -0.011862 0.009413
C  0.122762 1.171734 0.4486
C  0.128329 -1.188482 0.321431
C  2.663184 1.469616 -0.1730
C  2.669528 -1.406359 -0.328979
C  -5.384243 0.04153 -1.239703
C  3.845097 0.758211 -0.508895
C  3.848175 -0.657652 -0.585854
H  -2.278635 -0.97028 1.474209
H  -2.286516 0.826799 1.558365
H  -2.736651 -0.848198 -1.005917
H  -2.745747 0.934087 -0.921621
H  -4.711498 0.845655 0.672913
H  -4.702078 -0.929878 0.590061
H  2.648907 2.562172 -0.109612
H  2.660026 -2.499429 -0.383993
H  -5.19167 -0.820635 -1.905187
H  -6.454031 0.023067 -0.962606
H  -5.201225 0.963842 -1.822166
H  4.769753 1.308999 -0.712096
H  4.775167 -1.179159 -0.847311
