program: Gaussian 09
title: 000068817
version: EM64L-G09RevD.01
frameworkgroup: C1[X(C19H24N2O4S)]
method: RPBEPBE
basis: SDD
operation: Freq
keyword: #p
keyword: freq=noraman
keyword: PBEPBE/SDD
title: #p freq=noraman PBEPBE/SDD
converged: NO YES NO NO
title: Mulliken charges:
elementType: S O O O O N N C C C C C C C C C C C C C C C C C C C H H H H H H H H H H H H H H H H H H H H H H H H
charge: 0.208228 -0.280559 -0.284937 -0.288613 -0.290514 -0.405242 0.025244 -0.364622 0.121811 0.133461 0.625117 0.186118 0.187473 0.103519 0.114455 -0.818914 -0.818054 -0.567815 -0.308244 -0.208786 -0.367317 -0.214460 -0.243270 -0.828707 -0.677787 -0.670002 0.296021 0.306924 0.239990 0.324549 0.217566 0.324602 0.238840 0.218930 0.249412 0.226148 0.238406 0.222626 0.228988 0.226901 0.232730 0.273213 0.230837 0.280771 0.245016 0.223908 0.203388 0.229790 0.240704 0.212157
chargesum: 0.00000
title: Mulliken charges with hydrogens summed into heavy atoms:
elementType: S O O O O N N C C C C C C C C C C C C C C C C C C C
charge: 0.208228 -0.280559 -0.284937 -0.288613 -0.290514 -0.098318 0.025244 -0.068601 0.121811 0.133461 0.625117 0.186118 0.187473 0.103519 0.114455 -0.036809 -0.035681 -0.567815 -0.058832 0.017362 -0.128910 0.237155 0.216361 -0.043886 -0.005475 0.012648
polarizability: 3.19787423e+02 1.05622518e+01 2.45516793e+02 -2.05739332e+01 -6.16232126e+00 2.25481509e+02
1716.lowfreq: -9.3309 -3.1123 -0.0013 -0.0003 0.0008 5.6239 11.5110 22.7953 30.3307
frequency: 7.5790 22.6554 30.1871 33.9390 40.8718 47.4557 52.2278 58.7507 59.9516 67.3934 71.1404 81.6609 94.9754 104.7680 114.6240 120.8560 133.9974 147.6996 156.4258 194.5320 210.6732 222.5283 239.0953 257.6989 268.0797 275.7764 301.2421 324.7664 332.9410 340.1658 357.8087 370.0580 378.8321 387.4883 412.4607 437.3653 448.9628 462.1924 521.2961 541.1370 565.3964 568.7314 576.5555 594.2854 626.3459 660.5782 676.3461 681.3498 713.5350 729.7324 743.9912 760.4083 768.1265 785.5600 801.2707 812.6259 824.4124 830.3311 838.4871 844.5545 928.3945 955.6548 968.2188 974.2095 981.4064 982.7836 1011.8780 1030.0309 1034.1018 1037.1271 1050.3294 1050.8282 1052.2495 1057.1562 1092.6031 1098.0791 1111.7341 1122.2024 1132.5936 1137.5352 1156.0740 1172.1523 1194.2976 1238.0910 1245.8306 1254.3861 1278.4338 1283.7598 1301.5310 1304.3774 1311.4479 1333.6206 1342.4086 1354.0272 1355.1201 1387.2522 1393.3487 1395.6372 1396.4917 1402.8954 1417.2070 1429.2293 1434.8884 1449.4667 1450.7394 1455.8842 1458.9148 1462.3098 1475.5427 1480.4498 1483.4723 1489.6809 1493.4254 1494.8751 1541.9313 1571.3944 1575.4312 1589.1013 1638.1702 1658.5568 2969.1030 2969.9670 2991.3406 2992.1264 3006.1030 3018.7453 3030.4613 3043.0555 3043.4258 3065.3057 3073.6037 3087.0205 3090.5450 3092.1886 3105.4374 3118.3075 3127.7078 3129.4531 3130.7479 3140.2358 3145.6402 3154.4434 3168.5886 3541.5728
redmass: 2.8709 4.7243 2.8229 3.1573 2.1792 1.6270 6.0362 3.8778 5.2671 1.6995 1.9332 3.3897 3.4615 3.5262 3.5829 3.9558 3.7938 1.2730 2.1027 3.9695 1.4010 3.1675 1.5997 2.3813 3.6498 3.1673 3.3670 4.7969 5.3615 4.3976 4.9621 4.9649 7.4929 5.9251 3.6549 6.7990 3.9513 4.1531 3.8653 3.4098 1.7983 5.0927 4.8475 2.7453 3.9404 7.0059 5.8993 7.3686 6.3829 5.8412 4.3519 3.2009 4.4104 1.9296 1.2676 1.4499 2.6035 5.1795 3.6763 3.5351 1.4081 1.6637 1.4104 1.2178 1.8041 1.7197 2.7096 3.1597 3.7087 1.9195 1.6782 3.7273 1.5252 4.4304 2.5523 2.9066 2.2526 3.3999 2.2976 1.5033 1.6948 1.9433 2.1895 1.9157 1.1418 3.5082 1.1252 2.6995 4.5478 2.1280 2.2293 2.0065 1.2043 1.3483 1.4530 1.2366 1.2377 1.2587 1.2704 2.0544 1.9303 1.0543 1.2973 1.0949 1.0609 1.0999 1.0407 1.0419 1.0667 1.6061 1.0550 1.0671 1.0529 1.0687 5.6090 5.5907 7.9451 8.1205 4.1560 7.6900 1.0400 1.0400 1.0360 1.0356 1.0584 1.0288 1.0585 1.0972 1.0972 1.1057 1.0841 1.0977 1.0988 1.1026 1.1022 1.1066 1.0881 1.0960 1.0959 1.1032 1.0903 1.1051 1.0998 1.0772
irintensity: 0.0648 0.0941 0.1593 0.4256 0.4631 0.5579 2.2845 3.2899 1.6260 1.9304 0.2179 1.7991 1.1129 0.2796 0.6376 0.8542 2.9592 1.1910 2.5520 4.7741 4.0785 1.2056 0.7843 2.5189 2.4369 0.8522 1.8253 0.8421 0.8793 5.1749 1.3153 21.6816 5.8475 12.7899 2.6839 5.1892 0.9226 0.7621 2.5769 0.1826 31.0178 4.5977 4.4505 22.9245 11.5166 1.6079 7.6136 15.1953 17.8983 0.4295 2.4486 16.0416 15.0386 12.7027 9.5630 8.4325 4.2883 20.2563 0.6727 0.5891 0.1996 1.8196 0.2465 1.8809 11.4195 7.3815 14.1287 123.2915 6.4235 44.7858 22.1436 77.6989 2.0656 374.4255 59.8820 29.9212 10.4285 129.1338 9.0381 7.9809 26.9743 3.6746 197.9033 29.3274 0.0744 179.3336 11.5625 26.2666 41.3391 6.1225 48.2133 20.4849 5.1988 7.2024 7.4384 26.7189 107.9331 15.4202 58.1961 93.2735 7.0984 10.2447 309.0564 7.8549 18.5147 22.1310 8.5921 14.1853 5.5208 97.9286 19.6681 24.4898 18.3285 28.5711 24.5062 41.7710 451.5463 69.5903 10.1612 222.7842 7.0476 78.5834 23.5466 29.4092 26.6324 32.7806 29.2458 0.9174 30.8747 10.3096 0.3430 38.6577 32.5554 5.0642 32.2226 22.9800 14.0086 6.2226 6.3815 11.5884 15.3523 10.0913 25.4775 45.6052
temp: 298.150 k
press: 1.00000 atm
elementType: 16 8 8 8 8 7 7 6 6 6 6 6 6 6 6 6 6 6 6 6 6 6 6 6 6 6 1 1 1 1 1 1 1 1 1 1 1 1 1 1 1 1 1 1 1 1 1 1 1 1
symmnumber: 1
zpe: 1042730.8 jmol-1
zpe.correction: 0.397155 hartree
zpe.thermalcorrener: 0.426011 hartree
zpe.thermalcorrenthalpy: 0.426955 hartree
zpe.thermalcorrgfe: 0.332870 hartree
zpe.sumelectzpe: -1544.945985 hartree
zpe.sumelectthermal: -1544.917129 hartree
zpe.sumelectthermalent: -1544.916185 hartree
zpe.sumelectthermalfe: -1545.010270 hartree
dipole: -2.0539 -0.4186 0.4494
dipole: 2.1438
quadrupole: -129.9055 -174.4837 -152.6889
quadrupole: 5.6229 -8.8433 -2.3791
quadrupole: 22.4539 -22.1243 -0.3295 5.6229 -8.8433 -2.3791
hfenergy: -1545.3431401 hartree
pointgroup: C01 [X(C19H24N2O4S1)]
dipole: 0.1549364 -0.635729 0.5321921 debye
polarizability: 243.9722827|-4.346188|284.3193368|11.9673735|-49.7127572|262.4941063 unknown
InChI: InChI=1S/C19H24N2O4S/c1-6-24-18(22)14-11(3)21-12(4)15(19(23)25-7-2)16(14)13-9-8-10-20-17(13)26-5/h8-10,16,21H,6-7H2,1-5H3
charge 0 multiplicity 1
50 atoms
S  -0.588222 2.310013 -1.416703
O  2.201904 0.181904 -1.509479
O  -2.34935 -0.291818 -1.29964
O  3.812075 -0.908346 -0.233927
O  -3.518756 -2.009772 -0.244389
N  0.369578 -2.981928 1.512854
N  -0.468899 3.010456 1.2084
C  0.030241 -0.641785 -0.070942
C  1.407044 -1.297499 0.163143
C  -1.115733 -1.641145 0.192264
C  -0.121076 0.606214 0.835562
C  1.53536 -2.386375 1.004609
C  -0.924913 -2.721947 1.035459
C  2.590153 -0.699313 -0.492508
C  -2.433849 -1.384062 -0.42473
C  2.805795 -3.093342 1.421702
C  -1.952824 -3.729071 1.502127
C  -0.371754 1.939432 0.374393
C  -0.000876 0.449809 2.238931
C  -0.113052 1.550687 3.115374
C  -0.341374 2.820618 2.549712
C  3.304137 0.866969 -2.244801
C  -3.586049 0.111981 -2.022902
C  -0.650235 4.189158 -1.353031
C  2.684544 1.481742 -3.496306
C  -3.641435 -0.562638 -3.397389
H  -0.022784 -0.308308 -1.118403
H  0.487154 -3.786018 2.131642
H  2.876129 -4.083637 0.931302
H  3.686413 -2.499147 1.145371
H  2.813228 -3.258958 2.517319
H  -2.962811 -3.412891 1.21153
H  -1.758571 -4.721625 1.050603
H  -1.903112 -3.843951 2.602753
H  0.191044 -0.54832 2.645491
H  -0.021747 1.431037 4.199101
H  -0.426601 3.719002 3.171791
H  3.737167 1.630144 -1.572028
H  4.090885 0.125733 -2.472702
H  -3.489346 1.206423 -2.105477
H  -4.457831 -0.15976 -1.403102
H  0.279854 4.583627 -0.920281
H  -0.765061 4.508365 -2.402028
H  -1.50258 4.514683 -0.741896
H  1.865045 2.167783 -3.222841
H  2.273607 0.698887 -4.156752
H  3.453712 2.044721 -4.056434
H  -2.727519 -0.346127 -3.976256
H  -3.746888 -1.656168 -3.295434
H  -4.51022 -0.182238 -3.966655
