program: Gaussian 09
title: 000073787
version: EM64L-G09RevD.01
frameworkgroup: C1[X(C2H4Cl4Si)]
method: RPBEPBE
basis: SDD
operation: Freq
keyword: #p
keyword: freq=noraman
keyword: PBEPBE/SDD
title: #p freq=noraman PBEPBE/SDD
converged: NO NO NO NO
title: Mulliken charges:
elementType: Cl Cl Cl Cl Si C C H H H H
charge: -0.254346 -0.254335 0.035196 0.035163 0.999537 -0.795328 -0.960964 0.368672 0.278084 0.274160 0.274160
chargesum: 0.00000
title: Mulliken charges with hydrogens summed into heavy atoms:
elementType: Cl Cl Cl Cl Si C C
charge: -0.254346 -0.254335 0.035196 0.035163 0.999537 -0.426655 -0.134560
polarizability: 8.08629987e+01 8.88995745e-04 9.99441446e+01 -5.77019498e+00 -2.65094570e-04 6.12601996e+01
1716.lowfreq: -12.3616 -9.4880 -0.0034 -0.0009 0.0021 6.3535 37.1631 88.7363 118.8988
frequency: 37.0806 88.7326 118.8927 145.8416 152.1663 159.3844 172.1483 220.7982 237.6507 298.7323 437.4690 500.0794 577.9961 636.5091 703.5813 796.6180 881.3287 883.5880 1147.7052 1169.4520 1324.4517 1431.2430 1436.4414 3001.9951 3113.3849 3116.1119 3124.4963
redmass: 15.3352 21.7074 5.3456 10.5463 1.0610 3.7518 9.8134 8.9788 9.1021 15.0480 9.7801 13.2344 7.4610 11.1744 5.4403 6.1783 1.3291 1.3609 1.1638 1.0568 1.1829 1.0471 1.0476 1.0337 1.0995 1.0993 1.0876
irintensity: 0.5768 1.1508 6.8124 1.6856 0.0036 0.0895 12.4951 0.9656 12.6389 2.5040 63.1394 75.8076 25.1786 92.9698 15.2008 31.7286 62.7248 73.1513 1.0957 3.3671 33.2197 9.1820 12.1917 0.0791 0.8588 0.6261 0.2694
temp: 298.150 k
press: 1.00000 atm
elementType: 17 17 17 17 14 6 6 1 1 1 1
symmnumber: 1
zpe: 154999.4 jmol-1
zpe.correction: 0.059036 hartree
zpe.thermalcorrener: 0.069345 hartree
zpe.thermalcorrenthalpy: 0.070289 hartree
zpe.thermalcorrgfe: 0.021015 hartree
zpe.sumelectzpe: -2207.759363 hartree
zpe.sumelectthermal: -2207.749054 hartree
zpe.sumelectthermalent: -2207.748110 hartree
zpe.sumelectthermalfe: -2207.797384 hartree
dipole: -0.6439 -0.0003 1.6503
dipole: 1.7715
quadrupole: -83.8075 -83.1615 -71.3630
quadrupole: -0.0009 3.4473 -0.0002
quadrupole: -4.3635 -3.7175 8.0810 -0.0009 3.4473 -0.0002
hfenergy: -2207.8183993 hartree
pointgroup: C01 [X(C2H4Cl4Si1)]
dipole: -0.1963427 0.0003476 -0.6687186 debye
dipolederiv: -0.4900671 0.1768803 -0.0663892 0.2134516 -0.6240824 0.1445398 -0.0483971 0.1287079 -0.4109164 -0.4901568 -0.1768692 -0.0665569 -0.2134486 -0.6237759 -0.1446818 -0.0485882 -0.1288578 -0.4111096 -0.3492677 -0.2895231 -0.0443967 -0.1818522 -0.5493978 -0.0585418 -0.0124564 -0.119021 -0.1179693 -0.3491856 0.2895079 -0.0441926 0.1818077 -0.5496655 0.0582799 -0.0123026 0.1187445 -0.1178823 1.6316367 -0.0000602 0.1666114 -0.0000089 1.6648743 0.0001104 0.0109006 0.0001303 1.3242016 0.2712345 0.00005 0.0835264 0.0000692 0.8857924 0.0002932 0.0720665 0.0003043 -0.0842918 -0.3964159 0.0000145 -0.0345078 -0.0000105 -0.3432447 0.0000352 0.0436266 0.0000219 -0.415886 -0.004772 -0.0000072 0.020474 -0.0000134 -0.0247948 -0.0000143 0.0158567 -0.000013 0.008315 -0.0151028 0.0000085 0.0410477 -0.0000132 0.1275951 0.0000045 0.0975218 -0.0000028 0.0940401 0.09603 -0.0612896 -0.0278353 -0.0566259 0.0184071 -0.033192 -0.0591467 -0.0723459 0.0657124 0.0960668 0.0612882 -0.0277808 0.0566443 0.0182923 0.0331668 -0.0590813 0.0723316 0.0657862 unknown
polarizability: 79.7246481|-0.0006955|99.9441413|7.3698147|0.0111218|62.3985536 unknown
InChI: InChI=1S/C2H4Cl4Si/c1-7(5,6)2(3)4/h2H,1H3
charge 0 multiplicity 1
11 atoms
Cl 1.717272 -1.764488 0.724323
Cl 1.717732 1.763605 0.725607
Cl -1.958958 -1.540948 0.045461
Cl -1.958587 1.54149 0.046442
Si 0.726443 0.000026 -0.096529
C  -1.063076 -0.000049 0.623133
C  0.814257 0.000683 -1.973175
H  -1.114056 -0.000369 1.720264
H  1.865994 0.000631 -2.306584
H  0.315693 -0.897809 -2.376193
H  0.315988 0.899629 -2.375549
