program: Gaussian 09
title: 000068811
version: EM64L-G09RevD.01
frameworkgroup: C1[X(C17H26N2O3)]
method: RPBEPBE
basis: SDD
operation: Freq
keyword: #p
keyword: freq=noraman
keyword: PBEPBE/SDD
title: #p freq=noraman PBEPBE/SDD
converged: YES YES NO NO
title: Mulliken charges:
elementType: O O O N N C C C C C C C C C C C C C C C C C H H H H H H H H H H H H H H H H H H H H H H H H H H
charge: -0.287646 -0.443917 -0.277543 -0.077771 -0.339625 0.276719 0.071410 -0.472435 0.309993 -0.438102 -0.491290 -0.435875 -0.101415 0.264632 -0.249356 -0.698764 -0.685941 -0.724330 -0.389936 -0.380580 -0.242626 -0.061995 0.245257 0.231576 0.228944 0.222350 0.276989 0.239484 0.184138 0.252426 0.239725 0.174289 0.229030 0.214691 0.204949 0.214161 0.224016 0.199723 0.238058 0.206745 0.234517 0.210913 0.200227 0.233510 0.252585 0.224395 0.160321 0.333375
chargesum: 0.00000
title: Mulliken charges with hydrogens summed into heavy atoms:
elementType: O O O N N C C C C C C C C C C C C C C C C C
charge: -0.287646 -0.110542 -0.277543 -0.077771 -0.099900 0.276719 0.071410 0.004398 0.309993 0.013192 0.025183 0.000689 0.072875 0.264632 0.194365 -0.055638 -0.041415 -0.078673 -0.156426 -0.127995 -0.018231 0.098326
polarizability: 2.53027367e+02 -1.05035036e+01 1.94570344e+02 -1.15485466e+01 -2.21506556e+01 1.78646020e+02
1716.lowfreq: -9.2679 -7.3085 -0.0009 -0.0006 -0.0006 6.3744 14.5064 21.3514 26.0812
frequency: 13.5262 21.2324 25.6808 33.6998 55.8787 68.3259 86.9206 96.0458 120.5017 147.4595 167.4676 174.5892 201.9189 211.2352 226.4420 237.5442 248.6138 251.4359 259.1365 264.4531 272.3757 300.9253 307.1973 333.0588 355.8527 368.5229 398.7722 415.1756 433.7374 448.5233 452.7840 473.8618 487.5331 501.1276 541.3645 554.6158 585.1677 610.8908 645.5076 662.4161 714.4760 717.2300 740.7206 773.5534 792.1650 831.2958 847.5281 865.3236 883.6941 895.6958 903.9819 920.8450 923.7064 938.2208 940.8631 958.5220 960.4414 978.3184 991.6798 1007.4009 1015.6549 1026.1434 1053.0662 1054.7633 1079.2179 1082.6875 1100.4943 1112.6623 1161.6554 1177.3042 1183.0423 1185.3776 1198.1349 1204.6547 1210.7084 1216.8733 1226.1550 1236.9586 1248.8576 1257.9846 1260.3472 1275.9913 1305.6703 1325.9564 1331.9315 1353.8849 1358.5624 1367.4780 1372.2906 1379.0046 1381.8553 1392.5794 1394.2645 1406.0299 1407.2285 1441.0820 1446.3769 1450.2670 1452.4975 1459.1768 1460.6544 1461.8109 1467.7584 1471.5772 1473.2222 1478.7466 1484.0433 1486.8087 1492.8295 1594.6891 1608.8026 1624.9985 2844.4797 2914.0987 2920.1451 2945.6466 2965.6433 2969.5580 2970.4376 2982.2748 2983.5702 2987.3850 3035.4007 3047.1690 3049.1895 3053.9167 3060.3286 3066.2569 3066.7261 3074.8669 3088.4918 3090.0027 3096.4624 3122.8575 3146.0312 3171.7685 3420.1016 3550.9818
redmass: 5.0286 4.2626 2.6776 5.9416 3.7692 4.6642 3.2682 3.7575 3.7665 3.0009 1.4579 3.0535 2.9263 3.1855 1.6412 1.3657 1.2872 1.8012 2.2860 1.9900 2.4116 2.9726 2.4070 2.3059 2.3084 2.4470 2.4745 4.1972 2.2479 4.2319 3.6706 2.8606 3.2344 3.2005 4.6290 3.8340 4.5317 3.4746 1.5872 3.5259 3.1151 3.2951 3.3859 1.5448 3.5316 3.5566 2.8737 1.4448 2.0467 2.5000 2.0294 2.3057 1.6731 2.4140 1.2379 1.5560 1.3836 1.8062 2.2557 1.6370 1.4114 2.2583 2.2594 2.3708 2.4666 2.1480 2.0172 3.8308 1.5828 1.5129 1.3364 1.2728 1.7748 1.8090 2.3588 1.2235 1.4283 2.8211 2.3075 2.2372 1.2951 1.8224 1.2087 1.7984 1.4907 1.3417 1.3423 1.2171 1.2540 1.4308 1.3777 2.8552 1.2476 2.3699 2.0441 1.3246 1.1633 1.2245 1.0904 1.4765 1.1311 1.0661 1.2309 1.1075 1.1409 1.0782 1.7568 1.1266 1.0676 6.7614 7.0365 6.7921 1.0720 1.0821 1.0853 1.0686 1.0353 1.0655 1.0377 1.0560 1.0361 1.0630 1.0908 1.0940 1.1074 1.1011 1.0982 1.0996 1.0981 1.0978 1.0874 1.0994 1.0997 1.0870 1.0933 1.0960 1.0739 1.0658
irintensity: 0.1665 0.2195 0.0144 1.9456 1.0152 0.2676 2.9950 3.8668 1.2018 0.5246 4.4398 2.4255 18.8986 6.5006 11.6107 13.2297 29.8283 23.2546 3.1569 48.5635 18.7209 11.2478 10.8048 1.0675 12.8799 6.9670 11.7546 5.8176 5.3445 0.9037 2.9943 4.6882 1.2444 13.6851 9.0753 0.1592 10.9107 8.6742 73.3059 4.2218 20.3920 8.9141 2.4055 64.2465 7.1016 15.9203 10.5381 1.0090 7.3104 7.3088 0.1425 34.2670 2.3061 3.2140 0.7548 1.5366 2.3856 3.5205 2.9480 13.3138 1.2923 73.3072 38.3972 8.9330 99.8382 35.3255 10.5771 19.1865 65.7512 3.8645 20.9407 52.9897 0.5977 63.9687 52.6585 9.7363 31.0827 35.7942 145.3725 12.6436 12.9507 12.7311 6.6674 2.0415 25.3489 10.6098 6.7208 27.9137 22.6321 18.6832 7.4473 14.1115 10.4014 82.8038 24.5731 105.7327 17.0071 1.2281 2.6282 22.0315 3.8960 1.9817 1.4245 11.1150 21.5042 12.8030 14.3926 6.2640 21.2045 163.6018 43.4835 348.7956 129.5777 64.2515 89.7846 25.2743 28.3839 56.3652 37.7647 41.7594 20.0988 15.2361 6.4943 27.8179 22.6520 33.4073 3.4369 8.5297 56.0273 77.0059 13.8022 9.9273 60.1154 4.1872 26.0609 15.0979 2.6351 4.2111
temp: 298.150 k
press: 1.00000 atm
elementType: 8 8 8 7 7 6 6 6 6 6 6 6 6 6 6 6 6 6 6 6 6 6 1 1 1 1 1 1 1 1 1 1 1 1 1 1 1 1 1 1 1 1 1 1 1 1 1 1
symmnumber: 1
zpe: 1064507.7 jmol-1
zpe.correction: 0.405450 hartree
zpe.thermalcorrener: 0.428895 hartree
zpe.thermalcorrenthalpy: 0.429839 hartree
zpe.thermalcorrgfe: 0.350509 hartree
zpe.sumelectzpe: -996.863993 hartree
zpe.sumelectthermal: -996.840548 hartree
zpe.sumelectthermalent: -996.839604 hartree
zpe.sumelectthermalfe: -996.918933 hartree
dipole: -8.1979 -0.9107 -1.3128
dipole: 8.3522
quadrupole: -155.6187 -126.3550 -131.5425
quadrupole: 3.7216 -12.6381 -6.3156
quadrupole: -17.7800 11.4838 6.2962 3.7216 -12.6381 -6.3156
hfenergy: -997.2694427 hartree
pointgroup: C01[X(C17H26N2O3)]
dipole: 3.1520378 -0.5988938 0.7097796 debye
polarizability: 255.1175704|6.0338653|188.8304298|-3.7762988|24.3780693|182.2957311 unknown
InChI: InChI=1S/C17H26N2O3/c1-17(2,3)18-9-14(21)11-22-16-6-4-5-13-10-19(12-20)8-7-15(13)16/h4-6,12,14,18,21H,7-11H2,1-3H3
charge 0 multiplicity 1
48 atoms
O  0.766018 1.05804 -0.497689
O  2.766404 1.796735 -2.504094
O  -5.930793 -1.018462 -1.520954
N  -3.728917 -1.192315 -0.721142
N  3.870508 -0.378889 0.380513
C  3.756722 -1.780186 0.903297
C  -1.497407 0.451835 -0.049089
C  -1.338337 -0.655914 -1.080097
C  -2.718284 0.64798 0.639389
C  -2.381136 -1.769462 -0.860414
C  -3.936348 -0.23275 0.376992
C  3.383418 -0.079219 -0.977879
C  3.093455 1.434704 -1.116743
C  -0.401172 1.31935 0.236576
C  1.93657 1.910842 -0.242799
C  4.480053 -2.81471 -0.010841
C  2.261769 -2.160458 1.048034
C  4.418097 -1.771938 2.303291
C  -2.836244 1.681276 1.605156
C  -0.516117 2.351757 1.195911
C  -1.743157 2.523546 1.877697
C  -4.76195 -1.497345 -1.586064
H  -1.443737 -0.236396 -2.099928
H  -0.317293 -1.07448 -1.021297
H  -2.128775 -2.338399 0.057938
H  -2.387041 -2.479551 -1.707141
H  -4.816334 0.379099 0.105219
H  -4.207425 -0.778355 1.30652
H  4.099866 -0.371236 -1.788566
H  2.44245 -0.621059 -1.162826
H  4.825173 -0.020843 0.528034
H  3.995645 2.00097 -0.783349
H  1.69645 2.962813 -0.492237
H  2.237377 1.822673 0.819162
H  5.561167 -2.588224 -0.083185
H  4.372433 -3.840393 0.388702
H  4.056809 -2.806648 -1.032468
H  1.764656 -2.262666 0.066195
H  1.726488 -1.387799 1.626547
H  2.167619 -3.12944 1.57105
H  3.899017 -1.059868 2.968754
H  4.378582 -2.776739 2.760107
H  5.483193 -1.47297 2.238791
H  -3.787273 1.825525 2.131232
H  0.322752 3.017394 1.414586
H  -1.839035 3.324462 2.61897
H  -4.450318 -2.227264 -2.369511
H  3.430904 1.380476 -3.110449
