program: Gaussian 09
title: 000073784
version: EM64L-G09RevD.01
frameworkgroup: C1[X(C5H9I)]
method: RPBEPBE
basis: SDD
operation: Freq
keyword: #p
keyword: freq=noraman
keyword: PBEPBE/SDD
title: #p freq=noraman PBEPBE/SDD
converged: NO NO NO NO
title: Mulliken charges:
elementType: I C C C C C H H H H H H H H H
charge: -0.019839 -0.500040 -0.424716 -0.424715 -0.414681 -0.414719 0.307141 0.218794 0.266307 0.266315 0.218768 0.218812 0.241871 0.241886 0.218816
chargesum: 0.00000
title: Mulliken charges with hydrogens summed into heavy atoms:
elementType: I C C C C C
charge: -0.019839 -0.192900 0.060385 0.060369 0.046002 0.045983
polarizability: 9.52860572e+01 3.07425075e-03 5.81907552e+01 1.16329679e+01 2.36349994e-03 6.07797238e+01
1716.lowfreq: -16.5788 -0.0004 -0.0001 -0.0001 1.2725 7.0376 64.8235 116.8847 251.7060
frequency: 64.5023 116.8741 251.7050 263.7496 458.2719 615.4421 676.0539 786.1738 799.8996 879.9777 897.2778 910.3855 944.2259 1012.4383 1064.9495 1075.1150 1108.5047 1159.3366 1196.9804 1202.1807 1202.3320 1255.0627 1286.6132 1290.2448 1315.8195 1320.5459 1444.8548 1455.8965 1465.6531 1482.7432 2965.4436 2971.7311 3008.6852 3022.2804 3059.1513 3075.7642 3079.6746 3091.4382 3096.0160
redmass: 1.6945 3.8391 2.5839 2.7802 2.5250 2.5709 2.1722 1.6681 1.6846 3.3902 2.0321 2.5598 1.5555 1.5136 2.5781 1.4436 1.0431 1.6873 1.3247 1.3106 1.4172 1.2527 1.1721 1.3452 1.4521 1.5133 1.0806 1.0814 1.0797 1.0922 1.0678 1.0678 1.0591 1.0626 1.1022 1.0968 1.0965 1.1030 1.0903
irintensity: 0.2273 0.3161 0.0336 3.8057 16.5121 0.3532 19.0387 8.3437 0.1070 1.3943 11.7999 14.2217 9.8547 0.9370 3.6954 1.1608 0.5949 3.9779 0.4329 85.0984 0.2536 0.3427 14.7732 0.0262 3.2175 7.3378 13.8485 11.6319 9.4258 8.0221 8.0869 41.6441 28.5078 51.4032 5.8485 5.3548 22.3308 56.2325 11.7808
temp: 298.150 k
press: 1.00000 atm
elementType: 53 6 6 6 6 6 1 1 1 1 1 1 1 1 1
symmnumber: 1
zpe: 337191.4 jmol-1
zpe.correction: 0.128429 hartree
zpe.thermalcorrener: 0.134890 hartree
zpe.thermalcorrenthalpy: 0.135834 hartree
zpe.thermalcorrgfe: 0.095782 hartree
zpe.sumelectzpe: -206.950417 hartree
zpe.sumelectthermal: -206.943956 hartree
zpe.sumelectthermalent: -206.943012 hartree
zpe.sumelectthermalfe: -206.983064 hartree
dipole: 2.6373 0.0001 0.8461
dipole: 2.7697
quadrupole: -50.5423 -52.2607 -50.7597
quadrupole: 0.0003 2.1221 0.0002
quadrupole: 0.6453 -1.0731 0.4278 0.0003 2.1221 0.0002
hfenergy: -207.0788459 hartree
pointgroup: C01 [X(C5H9I1)]
dipole: 0.9255907 -0.0000968 -0.5750837 debye
dipolederiv: -0.4286372 0.0000208 0.1875636 -0.000077 -0.1730621 0.0000412 0.2684337 -0.0000047 -0.30614 0.6836441 -0.0000229 -0.4362142 0.0000689 0.1471296 -0.0000123 -0.6482064 0.0000512 0.433028 -0.0627817 0.0352865 -0.0031254 0.0162923 -0.0598916 -0.0209855 0.182771 -0.0384446 -0.0260271 -0.0628663 -0.0353273 -0.0031032 -0.0163918 -0.0598382 0.0210928 0.1829075 0.0384847 -0.0261358 0.0930812 0.012913 -0.0804863 -0.025295 0.0023764 -0.0174367 -0.044533 -0.0398501 0.0641525 0.09298 -0.0129832 -0.0805231 0.025242 0.0024145 0.017452 -0.0444386 0.0398555 0.0641293 -0.1057574 -0.0000076 0.0336987 0.000005 0.0671393 -0.0000503 -0.0109964 -0.0000537 -0.1329649 -0.0627007 0.0625741 0.1298204 0.065423 0.0818531 -0.0306895 0.0372003 -0.0250688 -0.1020888 0.0460599 -0.1022717 -0.0149036 -0.0853898 -0.0898429 0.0030049 -0.0208254 0.0364097 0.0923855 0.0460222 0.1022983 -0.0149249 0.0854528 -0.089881 -0.0029744 -0.020844 -0.0363409 0.0923825 -0.0626112 -0.0625128 0.1298228 -0.0653961 0.0818776 0.0305763 0.0370623 0.0249653 -0.1019969 -0.1546324 0.1110627 0.0035659 0.0854416 0.0171082 -0.0071822 0.0292692 -0.0174504 0.0750532 0.0663994 -0.0480629 0.0726032 -0.0172529 0.0277708 0.0574577 0.0114641 0.0796504 -0.1004542 0.066352 0.0481462 0.0727408 0.0173559 0.0277991 -0.0574114 0.0116012 -0.0795996 -0.1004251 -0.1545518 -0.1111132 0.0034652 -0.0854788 0.0170473 0.0071173 0.0291345 0.0173959 0.0751017 unknown
polarizability: 87.762969|-0.003692|58.1907555|-18.3935659|0.0038406|68.3028118 unknown
InChI: InChI=1S/C5H9I/c6-5-3-1-2-4-5/h5H,1-4H2
charge 0 multiplicity 1
15 atoms
I  -2.288471 0.000107 0.801273
C  -0.657034 -0.000099 -0.758586
C  0.272243 -1.212432 -0.559975
C  0.272235 1.212267 -0.560292
C  1.251067 -0.784535 0.573157
C  1.250797 0.784738 0.57317
H  -1.235418 -0.000226 -1.694894
H  0.823062 -1.355198 -1.513851
H  -0.266203 -2.149592 -0.344955
H  -0.266195 2.149546 -0.345755
H  0.823262 1.354594 -1.514118
H  2.260618 -1.199868 0.406113
H  0.893201 -1.166877 1.544894
H  0.892375 1.166923 1.544764
H  2.260261 1.200453 0.406552
