program: Gaussian 09
title: 000068805
version: EM64L-G09RevD.01
frameworkgroup: C1[X(C13H29NO2)]
method: RPBEPBE
basis: SDD
operation: Freq
keyword: #p
keyword: freq=noraman
keyword: PBEPBE/SDD
title: #p freq=noraman PBEPBE/SDD
converged: YES YES NO NO
title: Mulliken charges:
elementType: O O N C C C C C C C C C C C C C H H H H H H H H H H H H H H H H H H H H H H H H H H H H H
charge: -0.306158 -0.468661 -0.597895 -0.383422 -0.379860 -0.381175 -0.377915 -0.372958 -0.398367 -0.353087 -0.251944 -0.356708 -0.264088 -0.044568 -0.696415 -0.426381 0.192316 0.193590 0.194643 0.196292 0.192052 0.193136 0.189819 0.191937 0.189846 0.189054 0.206467 0.212375 0.188081 0.187619 0.188002 0.185139 0.194669 0.194775 0.187687 0.223059 0.191119 0.209741 0.209758 0.215015 0.212430 0.226174 0.355330 0.283827 0.265651
chargesum: 0.00000
title: Mulliken charges with hydrogens summed into heavy atoms:
elementType: O O N C C C C C C C C C C C C C
charge: -0.306158 -0.113330 -0.048418 0.002483 0.011075 0.004013 0.003841 0.005942 0.020476 0.022613 0.121197 0.032735 0.146659 0.146551 -0.061901 0.012223
polarizability: 2.12136555e+02 -3.89317349e+00 1.36990164e+02 -1.02307504e-01 5.81643144e-01 1.28504407e+02
1716.lowfreq: -18.5841 -0.0015 0.0006 0.0013 4.6271 6.3511 10.5879 19.4378 27.0923
frequency: -7.6136 19.1845 26.9972 33.1372 52.6267 63.4613 66.2275 91.4066 100.6433 102.7777 123.7426 127.3719 134.7923 145.8080 148.9412 157.6018 192.5742 209.0710 232.9076 233.6685 284.6894 326.6456 361.9230 408.0332 438.1114 450.7188 483.7458 498.1525 513.0153 541.6737 638.1626 718.9541 722.9734 734.5267 758.0783 796.5423 846.5929 850.8258 883.8692 888.3015 907.3669 929.9420 967.4032 969.9736 984.9406 1003.2892 1020.8875 1024.1037 1040.2030 1050.2269 1059.7504 1070.2258 1079.9089 1081.2725 1082.6595 1092.9963 1114.7752 1125.6076 1139.6769 1159.8732 1184.0936 1203.5395 1209.7087 1211.3189 1240.6569 1244.1868 1258.2796 1266.4332 1272.6622 1275.0532 1277.2626 1281.8707 1287.3169 1293.9409 1296.5319 1304.0080 1314.9452 1326.0927 1337.7241 1352.1667 1354.8087 1357.7443 1372.9840 1388.6545 1394.9025 1409.3945 1458.6798 1459.1182 1460.3033 1462.8337 1464.5957 1468.8382 1473.9871 1477.4522 1479.4215 1483.5388 1484.2773 1488.0072 1491.6153 1643.8756 2913.7109 2926.3090 2932.5577 2944.0581 2948.8092 2949.1235 2951.7011 2952.5818 2957.3206 2962.7898 2963.2995 2967.7581 2970.9845 2982.3768 2987.0145 2987.4896 2993.7007 3003.3636 3016.6030 3027.4886 3029.5653 3040.2161 3043.1259 3055.3556 3067.5984 3069.9048 3464.2780 3513.6216 3590.9871
redmass: 2.5583 2.8623 3.7916 3.9579 1.6489 3.6096 3.3601 1.9152 2.7960 2.5502 2.2899 2.9219 2.6795 2.7243 2.1380 2.8929 2.0007 1.5589 1.8109 1.4879 3.4787 3.6003 3.3942 2.6652 3.7262 2.5440 3.4257 1.6522 1.6458 3.1286 1.3345 1.0596 1.0726 1.0933 1.1232 1.1650 1.2368 2.4986 2.0197 1.8800 1.2135 3.3136 1.4332 1.3216 5.0984 3.8275 1.0893 4.1269 1.9927 4.9613 3.1561 3.1894 2.6064 2.1158 2.3336 2.4612 2.4277 2.8807 1.3175 1.4998 1.7646 1.3092 1.3562 1.4016 1.3404 1.2872 1.1394 1.2199 1.2406 1.0771 1.2741 1.0652 1.1109 1.1101 1.1127 1.2479 1.3047 1.2343 1.4278 1.6009 1.6461 1.6383 1.4012 1.2172 1.4912 1.7927 1.0743 1.0721 1.0856 1.0664 1.0750 1.0809 1.0819 1.0423 1.0835 1.0835 1.0879 1.0902 1.0899 1.0934 1.0552 1.0717 1.0749 1.0660 1.0587 1.0586 1.0592 1.0591 1.0592 1.1054 1.0588 1.0584 1.0366 1.0963 1.0939 1.0629 1.0998 1.1024 1.1043 1.1005 1.1049 1.1047 1.0934 1.1045 1.1006 1.0993 1.0455 1.0648 1.0973
irintensity: 0.1457 0.2456 0.0818 0.1136 0.4913 0.1569 0.0343 2.8723 1.1870 1.5645 0.2464 0.9999 3.0306 0.9866 0.4021 3.6516 15.9462 17.8327 9.5544 6.3919 4.0935 4.4489 8.6386 1.3618 7.1051 4.2404 0.4624 73.2830 93.1839 10.0447 215.9471 16.7303 0.0193 5.7770 0.0628 1.5838 0.0974 3.3863 6.3409 5.0009 0.5824 34.0874 8.0018 10.8057 1.9072 1.8344 0.4055 22.7822 51.5097 97.7940 15.0147 44.4305 8.1821 2.9481 5.3560 27.2738 8.6051 11.7265 11.8220 11.6306 0.0695 11.3501 7.3043 2.2970 0.1318 1.5342 41.8892 0.1295 5.0442 0.2276 0.2575 0.3529 0.3581 0.0076 0.0543 8.7179 12.1520 9.2263 1.8983 1.1853 0.1488 0.4653 1.4351 11.2112 11.5164 22.8544 0.8138 0.0234 11.4188 0.3764 0.2659 0.0978 0.9614 12.3230 1.4829 6.0193 1.6396 21.8351 17.2467 46.1110 48.6241 78.8348 21.5712 85.8601 0.0588 0.0481 0.1465 6.8925 0.1883 43.5389 64.8509 185.5818 35.9046 0.1104 4.9161 46.1804 0.6678 0.2574 2.0363 33.7636 0.1765 143.0111 50.8160 133.0673 98.6999 57.0008 0.6028 22.6368 1.3556
temp: 298.150 k
press: 1.00000 atm
elementType: 8 8 7 6 6 6 6 6 6 6 6 6 6 6 6 6 1 1 1 1 1 1 1 1 1 1 1 1 1 1 1 1 1 1 1 1 1 1 1 1 1 1 1 1 1
symmnumber: 1
zpe: 1064916.1 jmol-1
zpe.correction: 0.405605 hartree
zpe.thermalcorrener: 0.426623 hartree
zpe.thermalcorrenthalpy: 0.427567 hartree
zpe.thermalcorrgfe: 0.352773 hartree
zpe.sumelectzpe: -716.589697 hartree
zpe.sumelectthermal: -716.568679 hartree
zpe.sumelectthermalent: -716.567735 hartree
zpe.sumelectthermalfe: -716.642529 hartree
dipole: -0.3953 -2.2549 0.0996
dipole: 2.2914
quadrupole: -95.0613 -107.2348 -100.4672
quadrupole: -14.2421 3.7553 0.5999
quadrupole: 5.8598 -6.3137 0.4539 -14.2421 3.7553 0.5999
hfenergy: -716.9953019 hartree
pointgroup: C01 [X(C13H29N1O2)]
dipole: 0.1591398 0.8865912 -0.0370648 debye
polarizability: 212.1043983|-4.1905849|136.8635037|0.1951741|-1.2843227|128.6632242 unknown
InChI: InChI=1S/C13H29NO2/c1-2-3-4-5-6-7-8-9-10-16-12-13(15)11-14/h13,15H,2-12,14H2,1H3
charge 0 multiplicity 1
45 atoms
O  -3.493098 -0.116537 0.253813
O  -5.598181 -1.848593 -0.18441
N  -7.671478 1.198849 0.394911
C  2.821294 0.480808 -0.230846
C  1.511088 -0.167908 0.269075
C  4.090917 -0.250086 0.26125
C  0.240825 0.554124 -0.234375
C  5.402677 0.387521 -0.249562
C  -1.063701 -0.113902 0.257649
C  6.671449 -0.35066 0.23414
C  -2.317015 0.597364 -0.260348
C  7.983744 0.281228 -0.283734
C  -4.769208 0.463514 -0.20485
C  -5.855941 -0.487478 0.307019
C  9.245315 -0.465231 0.201873
C  -7.264747 -0.104067 -0.174988
H  2.818898 0.501778 -1.34096
H  2.856743 1.540244 0.09942
H  1.480908 -1.22878 -0.056263
H  1.508526 -0.183349 1.37889
H  4.050216 -1.31132 -0.062687
H  4.098671 -0.265213 1.37134
H  0.251249 0.576006 -1.344392
H  0.266481 1.61275 0.098983
H  5.448011 1.447331 0.078526
H  5.391877 0.406889 -1.359695
H  -1.091654 -1.170964 -0.072006
H  -1.091167 -0.122733 1.364471
H  6.687128 -0.366592 1.34424
H  6.624668 -1.411603 -0.09018
H  -2.341607 1.654816 0.086482
H  -2.337157 0.601497 -1.374063
H  7.966371 0.29816 -1.39278
H  8.031045 1.340625 0.041879
H  -4.785448 0.501988 -1.316827
H  -4.916858 1.48332 0.201393
H  -5.825055 -0.479787 1.420538
H  9.235122 -1.519544 -0.134029
H  9.303553 -0.467248 1.30688
H  10.169171 0.003713 -0.18429
H  -7.248484 -0.01969 -1.277385
H  -7.941829 -0.951962 0.07453
H  -4.621146 -1.996796 -0.073394
H  -8.417149 1.670855 -0.12323
H  -7.869023 1.168865 1.400291
