program: Gaussian 09
title: 000073811
version: EM64L-G09RevD.01
frameworkgroup: C1[X(C10H21NO)]
method: RPBEPBE
basis: SDD
operation: Freq
keyword: #p
keyword: freq=noraman
keyword: PBEPBE/SDD
title: #p freq=noraman PBEPBE/SDD
converged: YES YES NO NO
title: Mulliken charges:
elementType: O N C C C C C C C C C C H H H H H H H H H H H H H H H H H H H H H
charge: -0.294400 -0.100949 -0.378022 -0.391439 -0.340850 -0.339574 -0.338613 -0.332945 0.212357 -0.696676 -0.691873 -0.795300 0.193565 0.251489 0.213110 0.224973 0.179278 0.231813 0.197693 0.200792 0.204547 0.187497 0.194705 0.194167 0.207778 0.215964 0.217363 0.212758 0.218587 0.213551 0.265723 0.229333 0.233597
chargesum: 0.00000
title: Mulliken charges with hydrogens summed into heavy atoms:
elementType: O N C C C C C C C C C C
charge: -0.294400 -0.100949 0.067032 0.046644 0.070241 0.058912 0.053431 0.055927 0.212357 -0.055571 -0.046977 -0.066647
polarizability: 1.36484467e+02 1.89292132e+00 1.24901764e+02 -4.56907377e+00 -6.96644312e-01 9.73923186e+01
1716.lowfreq: -6.7152 -0.0007 -0.0005 0.0002 3.1106 11.8599 27.0468 44.2762 62.3029
frequency: 26.4087 44.2608 62.0773 68.1608 75.4053 89.1968 105.5583 124.4095 147.2452 165.5770 226.9288 229.1943 230.7809 265.0309 293.1449 363.1057 386.8873 398.0810 446.8482 501.3445 572.3751 618.9246 731.7532 733.4239 746.9993 785.6512 790.5664 896.8529 899.6264 917.2171 922.7457 960.0516 1003.7809 1012.3835 1029.2928 1040.9490 1070.9597 1074.2171 1099.0971 1110.4925 1113.9321 1170.4415 1201.6211 1220.7058 1246.4983 1264.6433 1266.2878 1280.0765 1285.6732 1290.2029 1308.5897 1339.5892 1343.7738 1358.7951 1365.3505 1374.5032 1388.2180 1391.5594 1416.7333 1442.7077 1452.8048 1465.8603 1467.7470 1472.7329 1474.3261 1476.0809 1477.3034 1477.7068 1484.6534 1486.3533 1491.4389 1592.2769 2963.1924 2963.9176 2970.4676 2973.5743 2974.7994 2976.5138 2986.5381 2987.5927 2991.9236 3004.9154 3011.1044 3032.1860 3041.4804 3060.2250 3068.2028 3072.0325 3072.6543 3074.6783 3075.3617 3075.5781 3127.3222
redmass: 3.4299 2.3318 2.0351 2.5586 2.1196 3.1961 2.3349 2.1366 1.3065 2.0843 1.9689 1.1810 1.2885 3.4942 2.7959 3.4902 2.3413 2.6693 3.1129 3.3963 3.3238 4.1159 1.0752 1.1109 3.0935 1.1976 1.2514 1.7625 1.7231 1.4264 1.2354 1.8967 2.6264 3.3354 1.6646 2.2886 2.4889 2.4787 1.6709 2.2761 2.3679 2.1726 2.1196 1.5178 1.7820 1.2844 1.2803 1.2810 1.0725 1.1006 1.3006 1.3913 1.4821 1.4354 1.3753 1.2170 1.2158 1.2135 2.3901 1.1437 1.0656 1.0715 1.0937 1.0722 1.0678 1.0485 1.0453 1.0595 1.0934 1.0779 1.1098 5.7182 1.0589 1.0589 1.0619 1.0380 1.0489 1.0474 1.0549 1.0474 1.0640 1.0985 1.0962 1.1000 1.0980 1.1014 1.1011 1.1002 1.1004 1.0978 1.1014 1.1004 1.0982
irintensity: 0.3378 1.1163 1.5167 0.2106 1.0606 3.9439 0.6668 0.3478 0.0877 0.5471 0.5177 0.0720 0.2665 0.0837 4.3665 3.9196 2.7026 0.9788 11.4141 5.3928 6.0303 6.8887 7.8067 12.8245 0.8058 0.0660 0.4501 4.9345 13.5023 2.6090 3.6043 12.6760 2.0619 7.2058 5.9078 7.4679 0.2928 1.1943 12.5774 8.8729 15.4095 16.5183 12.6098 35.6832 16.8879 0.6488 0.3605 36.5913 1.7292 3.9877 20.3009 0.9142 1.7940 16.2794 6.2945 25.0629 10.2237 8.9936 110.5794 37.8851 21.9062 0.9998 4.9945 4.7394 3.3643 11.8799 12.2812 15.5659 10.6446 15.0776 16.4087 267.5773 19.4695 19.8257 29.2343 42.9244 15.4717 21.6085 48.9889 50.7453 32.3762 2.9928 10.5085 15.8667 13.8865 28.5984 16.8917 95.7198 31.6982 28.2908 26.3190 113.6067 11.4253
temp: 298.150 k
press: 1.00000 atm
elementType: 8 7 6 6 6 6 6 6 6 6 6 6 1 1 1 1 1 1 1 1 1 1 1 1 1 1 1 1 1 1 1 1 1
symmnumber: 1
zpe: 775541.7 jmol-1
zpe.correction: 0.295388 hartree
zpe.thermalcorrener: 0.311266 hartree
zpe.thermalcorrenthalpy: 0.312210 hartree
zpe.thermalcorrgfe: 0.250491 hartree
zpe.sumelectzpe: -522.648438 hartree
zpe.sumelectthermal: -522.632560 hartree
zpe.sumelectthermalent: -522.631616 hartree
zpe.sumelectthermalfe: -522.693334 hartree
dipole: -2.6951 -3.0724 1.6802
dipole: 4.4188
quadrupole: -75.4102 -83.2650 -77.1005
quadrupole: -6.9256 -0.0197 5.0087
quadrupole: 3.1817 -4.6731 1.4914 -6.9256 -0.0197 5.0087
hfenergy: -522.9438259 hartree
pointgroup: C01 [X(C10H21N1O1)]
dipole: 1.0496767 -1.2445313 -0.6096749 debye
polarizability: 136.4751742|-2.1886266|124.9596697|-4.3376556|-0.3270539|97.3437053 unknown
InChI: InChI=1S/C10H21NO/c1-4-6-8-11(10(3)12)9-7-5-2/h4-9H2,1-3H3
charge 0 multiplicity 1
33 atoms
O  -1.024556 2.566295 0.592996
N  0.014819 0.579814 -0.018682
C  -1.053194 -0.194276 0.65788
C  1.094521 -0.181281 -0.681209
C  -2.244512 -0.517709 -0.273059
C  2.24122 -0.594669 0.274125
C  -3.341025 -1.335087 0.446944
C  3.325197 -1.436889 -0.436578
C  -0.062238 1.96933 0.01028
C  -4.542986 -1.653764 -0.468115
C  4.468235 -1.857301 0.512297
C  1.044685 2.757519 -0.694439
H  -0.609708 -1.1301 1.05079
H  -1.41385 0.405791 1.511737
H  0.648082 -1.090933 -1.130211
H  1.506212 0.409696 -1.518458
H  -1.887851 -1.078981 -1.161512
H  -2.669847 0.435962 -0.639237
H  1.822129 -1.170632 1.123381
H  2.699802 0.315531 0.709942
H  -3.690689 -0.768713 1.333501
H  -2.906398 -2.281461 0.830836
H  3.742297 -0.858343 -1.286224
H  2.857835 -2.341991 -0.876253
H  -4.225645 -2.2396 -1.351478
H  -5.314535 -2.238222 0.066059
H  -5.01669 -0.724125 -0.834829
H  4.081459 -2.461419 1.354304
H  5.22976 -2.460459 -0.014871
H  4.97492 -0.972285 0.940497
H  0.91779 3.815702 -0.422241
H  2.057343 2.428869 -0.400658
H  0.96092 2.670131 -1.794116
