program: Gaussian 09
title: 000073770
version: EM64L-G09RevD.01
frameworkgroup: C1[X(C7H4F2O)]
method: RPBEPBE
basis: SDD
operation: Freq
keyword: #pfreq=noraman
keyword: PBEPBE/SDD
title: #p freq=noraman PBEPBE/SDD
converged: YES YES YES YES
title: Mulliken charges:
elementType: F F O C C C C C C C H H H H
charge: -0.187087 -0.184459 -0.201155 0.207930 0.255300 -0.279494 -0.492551 -0.369542 0.379987 -0.180577 0.285775 0.290949 0.269581 0.205343
chargesum: 0.00000
title: Mulliken charges with hydrogens summed into heavy atoms:
elementType: F F O C C C C C C C
charge: -0.187087 -0.184459 -0.201155 0.207930 0.255300 0.006281 -0.201601 -0.099961 0.379987 0.024766
polarizability: 1.14677653e+02 3.34384964e+00 8.37275199e+01 -2.57802455e-03 -3.67584248e-04 3.09871638e+01
1716.lowfreq: -8.2743 -2.1917 -0.0006 0.0007 0.0008 6.0171 99.5656 175.5553 182.5099
frequency: 99.5624 175.5541 182.5092 215.3841 292.8943 320.1746 366.4955 457.9381 465.1525 504.0456 603.6414 613.9453 703.1798 705.1770 794.3776 827.3301 859.8281 934.3777 967.7279 995.9209 1072.8150 1127.6592 1178.8477 1242.8960 1251.4330 1364.9057 1404.1029 1419.9647 1478.3182 1578.5078 1606.5129 1622.6481 2953.4321 3158.1952 3187.6113 3196.5363
redmass: 8.9835 2.9149 9.4943 6.9332 14.8941 4.1555 9.6270 2.9030 6.7951 10.0577 5.1175 6.6360 7.9132 2.9599 4.7023 1.3306 1.6304 4.5040 1.4177 1.6440 2.2548 1.5501 1.8517 8.8542 1.4644 2.0853 2.4190 4.7863 3.1014 8.9575 6.7855 7.4482 1.0873 1.0901 1.0964 1.0942
irintensity: 4.8860 10.6893 6.7107 0.2857 2.9663 5.6944 0.9218 11.8992 15.0506 13.6353 4.8072 17.4998 2.4294 1.0359 17.5504 15.7177 72.8833 61.4648 0.3265 4.7869 56.5884 7.9551 4.9584 170.9003 14.3673 11.1749 21.2997 38.5812 40.6980 124.9798 285.7204 58.8200 63.7519 0.7987 1.9511 1.7024
temp: 298.150 k
press: 1.00000 atm
elementType: 9 9 8 6 6 6 6 6 6 6 1 1 1 1
symmnumber: 1
zpe: 238832.1 jmol-1
zpe.correction: 0.090966 hartree
zpe.thermalcorrener: 0.099164 hartree
zpe.thermalcorrenthalpy: 0.100108 hartree
zpe.thermalcorrgfe: 0.057634 hartree
zpe.sumelectzpe: -543.332466 hartree
zpe.sumelectthermal: -543.324269 hartree
zpe.sumelectthermalent: -543.323325 hartree
zpe.sumelectthermalfe: -543.365798 hartree
dipole: 2.0384 0.3023 0.0002
dipole: 2.0607
quadrupole: -68.4871 -53.5288 -56.4539
quadrupole: -4.3297 -0.0003 -0.0006
quadrupole: -8.9971 5.9611 3.0361 -4.3297 -0.0003 -0.0006
hfenergy: -543.4234328 hartree
pointgroup: C01 [X(C7H4F2O1)]
dipole: 0.8032436 0.1100572 0.0000713 debye
dipolederiv: -0.3054061 0.3156236 0.0000071 0.2194438 -0.8907195 -0.0000015 0.0000023 -0.0000107 -0.1378881 -1.2032774 0.0427338 0.0000557 0.0385755 -0.2151638 -0.0000005 0.0000748 -0.0000008 -0.1449441 -0.9761612 -0.1328066 0.0000528 -0.4879932 -0.5392579 0.0000633 -0.0000799 -0.0000485 -0.332262 -0.9633857 -0.0748035 0.0000197 0.2277549 -0.311532 0.0000048 0.0000548 0.0000189 -0.0277406 0.7009939 -0.3330132 -0.0000394 -0.0410018 1.0527597 -0.0000115 0.0000134 0.0000063 0.1089366 0.2859548 0.0381628 -0.0000271 -0.2142676 0.090363 -0.0000031 0.0000024 -0.0000058 -0.072615 -0.4455981 0.2116591 0.0000161 0.2457196 -0.2464916 -0.0000175 0.0000116 -0.0000133 -0.1656693 -0.4266115 -0.1382781 0.0000163 -0.2957797 -0.0957142 0.0000171 0.0000232 0.0000066 -0.1754397 1.403144 -0.0529946 -0.0000713 0.0192213 0.5239901 -0.0000058 -0.0000895 -0.0000076 0.1293774 1.6812129 0.1313872 -0.0000399 0.1338253 0.6489731 -0.0000739 0.0000207 -0.0000291 0.1409142 0.0985814 -0.0641095 0.0000076 -0.0153125 0.0453218 0.0000066 0.0000063 0.0000061 0.1559712 0.0846237 -0.0322756 0.0000054 -0.0350035 0.0615295 0.0000065 0.0000014 0.0000104 0.2100971 0.0582694 0.0518044 0.0000038 0.0578172 0.0198559 0.0000002 -0.0000002 -0.0000013 0.1902887 0.00766 0.0369101 -0.0000066 0.1470007 -0.1439143 0.0000151 -0.0000414 0.0000687 0.1209735 unknown
polarizability: 114.7477638|3.0010767|83.6574087|-0.0025819|-0.0003391|30.9871638 unknown
InChI: InChI=1S/C7H4F2O/c8-6-2-1-5(4-10)7(9)3-6/h1-4H
charge 0 multiplicity 1
14 atoms
F  -0.740181 2.332217 0.000068
F  3.281615 -0.302598 -0.000117
O  -3.145299 -1.041984 0.000012
C  -0.922022 -0.09122 0.000136
C  -0.115818 1.073216 0.000055
C  -0.256351 -1.348933 0.000117
C  1.286372 1.041108 -0.000025
C  1.146351 -1.435447 0.000042
C  1.883044 -0.232227 -0.000024
C  -2.40674 -0.020059 0.000236
H  -0.880871 -2.248471 0.000175
H  1.883322 1.955907 -0.000082
H  1.669218 -2.395086 0.000034
H  -2.840939 1.004678 -0.000025
