program: Gaussian 09
title: 000068789
version: EM64L-G09RevD.01
frameworkgroup: C1[X(C17H26FNO2)]
method: RPBEPBE
basis: SDD
operation: Freq
keyword: #p
keyword: freq=noraman
keyword: PBEPBE/SDD
title: #p freq=noraman PBEPBE/SDD
converged: YES YES NO NO
title: Mulliken charges:
elementType: F O O N C C C C C C C C C C C C C C C C C H H H H H H H H H H H H H H H H H H H H H H H H H H
charge: -0.210145 -0.417346 -0.230403 -0.379138 0.042283 -0.034338 -0.529027 -0.388729 -0.370916 -0.724668 -0.721844 -0.500819 -0.364284 -0.490357 0.441046 -0.412559 -0.348086 0.172809 -0.363169 -0.362593 0.313944 0.171671 0.192982 0.235956 0.199908 0.182697 0.204645 0.258567 0.192653 0.196734 0.213221 0.206238 0.236824 0.209701 0.217542 0.206020 0.223094 0.200424 0.215278 0.216783 0.252675 0.251474 0.237474 0.273543 0.253327 0.252787 0.376122
chargesum: 0.00000
title: Mulliken charges with hydrogens summed into heavy atoms:
elementType: F O O N C C C C C C C C C C C C C C C C C
charge: -0.210145 -0.041224 -0.230403 -0.120571 0.213954 0.158644 -0.093163 -0.001387 0.018471 -0.068386 -0.088581 -0.077301 0.067777 0.013791 0.441046 -0.175085 -0.074543 0.172809 -0.109842 -0.109805 0.313944
polarizability: 2.25693173e+02 -1.42365518e+01 2.00867532e+02 -2.01096117e+01 -7.33372545e+00 1.60383438e+02
1716.lowfreq: -10.5054 -4.9652 -0.0005 -0.0005 -0.0004 7.5237 8.1438 10.3288 21.1936
frequency: 7.7143 9.2064 21.1748 27.6192 32.5968 50.3290 54.0203 76.2575 79.4470 99.3420 110.4826 128.5710 142.0924 170.2831 185.0360 201.0041 235.0596 253.6470 260.4021 269.9347 302.8304 323.2274 341.8340 356.1940 390.7231 412.7784 416.9141 450.6543 473.7730 493.7874 499.3878 499.7384 552.7576 574.5225 590.6319 625.1798 636.4927 644.7173 707.5321 717.1263 737.8826 756.1515 805.0186 817.1054 824.9013 834.6990 837.7043 859.2935 892.0370 909.3630 926.0470 937.0439 947.1289 956.0420 968.1545 977.8011 1006.0307 1009.7916 1022.2376 1051.8114 1061.5519 1081.7462 1084.1427 1094.9988 1110.2288 1121.2751 1125.8682 1139.9867 1152.0019 1157.8158 1185.1716 1191.2387 1201.6834 1216.3690 1226.7160 1234.9837 1246.7023 1267.8649 1275.2207 1286.8350 1287.3340 1292.8531 1301.4257 1321.8880 1327.5108 1336.8663 1350.8238 1357.5582 1367.1080 1369.4044 1372.4229 1386.3973 1392.4604 1407.9063 1437.5962 1453.7164 1460.4087 1465.2146 1466.5855 1468.9547 1475.1521 1478.6884 1480.6224 1483.4488 1490.1451 1495.0713 1603.2962 1613.2265 1669.0599 2841.7938 2856.5190 2952.8027 2959.0638 2960.1866 2968.1778 2974.0383 2981.7291 2983.3709 2986.5121 2995.2567 2997.2603 3020.5831 3032.5597 3043.0018 3058.2703 3061.3715 3065.2095 3069.9682 3080.2053 3128.5158 3151.0277 3171.7787 3174.6947 3445.2687 3511.9195
redmass: 7.9161 8.1992 4.1905 3.8259 3.5444 2.6499 3.1005 2.7602 2.9270 4.2349 2.9234 2.5489 3.2346 3.3001 1.1294 3.3395 3.6078 1.1371 3.0284 2.5200 3.7869 4.1557 3.2903 2.8372 3.9023 2.9126 3.0276 2.9780 3.6736 3.7338 2.3712 1.9462 3.2841 2.8888 4.1611 4.0336 1.3222 1.6416 3.3700 1.2684 2.2436 1.9581 1.8429 1.6299 1.9322 2.0257 2.4220 2.7655 1.8459 1.2672 1.7096 1.4131 1.7547 1.5466 1.4304 1.7252 2.7112 3.2467 2.0984 1.6136 2.8354 1.9863 2.3752 1.4546 1.8490 2.2199 2.5102 1.7274 1.4409 2.0441 1.8758 1.9097 1.3446 3.0820 1.3237 1.3219 1.4370 1.4212 1.2368 1.0946 1.2562 1.2054 1.2021 1.5009 1.4836 1.4477 1.4869 1.5903 1.3679 1.4696 1.8415 1.2610 3.6421 2.5236 1.0847 1.1264 1.0883 1.1053 1.0592 1.1156 1.0673 1.0947 1.1003 1.0983 1.0629 2.3119 7.7099 6.4718 8.2330 1.0808 1.0720 1.0613 1.0804 1.0620 1.0361 1.0367 1.0632 1.0846 1.0614 1.0597 1.0928 1.0994 1.0999 1.1003 1.0988 1.1030 1.0991 1.0984 1.0994 1.0899 1.0886 1.0956 1.0965 1.0746 1.0639
irintensity: 1.0783 0.2727 0.2377 0.4269 0.0771 0.1066 0.2869 0.2464 0.1240 1.2924 0.3190 0.2362 0.3087 0.4151 0.1335 0.4607 0.3699 0.4568 3.6611 2.9919 3.4513 4.6538 0.2533 1.1253 1.5776 1.6461 0.4151 11.0534 28.0228 8.0258 14.6842 40.1976 10.5376 6.1535 12.9762 18.7714 126.8688 58.0886 6.3286 7.8473 23.3510 10.3040 3.6667 29.0596 7.4419 48.7709 9.6152 2.5946 2.8105 2.2711 3.8410 7.7444 12.5190 6.6783 4.8050 6.0887 12.8309 126.7760 25.0798 46.8478 60.0217 23.6117 20.5233 16.2361 3.1584 45.7840 7.4473 6.3401 50.6116 9.6848 20.7251 6.3153 8.3040 22.3946 25.1631 1.5027 5.9929 13.8064 3.1207 1.7073 7.8836 3.8348 7.3994 25.3519 5.9607 15.2894 10.9806 4.1178 10.2140 18.4945 36.7131 25.6671 1.4632 1.3406 27.9753 20.8262 2.5727 4.4615 4.0429 3.0440 3.3521 15.4300 28.8159 25.5006 19.3278 95.8248 6.6815 11.0739 207.1139 69.0127 103.4579 1.0996 36.2791 51.0615 38.2395 19.1267 34.8060 21.5088 4.3583 35.4009 3.1064 41.9263 9.9113 44.5808 25.5881 79.1789 22.0396 93.9018 34.9160 12.1352 1.9653 6.2312 4.2890 0.8940 19.2441
temp: 298.150 k
press: 1.00000 atm
elementType: 9 8 8 7 6 6 6 6 6 6 6 6 6 6 6 6 6 6 6 6 6 1 1 1 1 1 1 1 1 1 1 1 1 1 1 1 1 1 1 1 1 1 1 1 1 1 1
symmnumber: 1
zpe: 1045822.7 jmol-1
zpe.correction: 0.398333 hartree
zpe.thermalcorrener: 0.421855 hartree
zpe.thermalcorrenthalpy: 0.422799 hartree
zpe.thermalcorrgfe: 0.339014 hartree
zpe.sumelectzpe: -966.817429 hartree
zpe.sumelectthermal: -966.793908 hartree
zpe.sumelectthermalent: -966.792963 hartree
zpe.sumelectthermalfe: -966.876749 hartree
dipole: -2.8433 1.9371 1.7687
dipole: 3.8685
quadrupole: -144.3627 -131.5585 -127.8638
quadrupole: 4.7603 -3.7183 -9.0868
quadrupole: -9.7677 3.0365 6.7312 4.7603 -3.7183 -9.0868
hfenergy: -967.2157622 hartree
pointgroup: C01 [X(C17H26F1N1O2)]
dipole: 1.0566833 0.8202147 -0.7259815 debye
polarizability: 223.2270326|15.3408206|203.2256125|-21.5186988|4.7154446|160.4914972 unknown
InChI: InChI=1S/C17H26FNO2/c1-13(2)16(6-4-3-5-7-17(20)21)19-12-14-8-10-15(18)11-9-14/h8-11,13,16,19-20H,3-7,12H2,1-2H3
charge 0 multiplicity 1
47 atoms
F  -6.236894 -2.994692 0.649196
O  7.122357 -1.363068 -1.074576
O  6.130969 -2.078756 0.898453
N  -1.151909 0.971514 0.19862
C  -0.123215 1.985149 -0.159548
C  -0.80695 3.300076 -0.66403
C  0.803858 2.2091 1.062854
C  1.812632 1.063267 1.336898
C  2.950176 0.962658 0.294793
C  -1.561947 4.046195 0.45853
C  0.198812 4.224095 -1.390431
C  -1.737149 0.210845 -0.92339
C  3.971812 -0.144399 0.636179
C  5.101859 -0.23467 -0.405956
C  -2.914871 -0.65258 -0.482592
C  -3.137811 -1.921238 -1.073749
C  -3.822241 -0.187494 0.504062
C  6.121602 -1.31065 -0.087818
C  -4.249577 -2.713536 -0.707087
C  -4.937023 -0.963262 0.889598
C  -5.125014 -2.210781 0.26947
H  0.506297 1.613774 -1.009235
H  -1.562377 2.987115 -1.416062
H  0.163639 2.360267 1.954457
H  1.372182 3.148237 0.920719
H  1.284931 0.087112 1.393451
H  2.263881 1.220284 2.337648
H  -0.834191 0.343161 0.948235
H  3.468952 1.942692 0.23387
H  2.524917 0.772874 -0.711667
H  -0.862414 4.496913 1.187581
H  -2.177893 4.863667 0.040058
H  -2.22638 3.347702 0.997962
H  0.725251 3.688783 -2.204171
H  -0.321445 5.091397 -1.836911
H  0.964075 4.621902 -0.696823
H  -2.08892 0.94366 -1.677489
H  -0.99028 -0.433298 -1.452424
H  4.408383 0.041987 1.636196
H  3.458164 -1.122675 0.706597
H  5.642871 0.728442 -0.492282
H  4.698502 -0.438413 -1.417504
H  -2.43828 -2.298767 -1.829188
H  -3.633507 0.785942 0.967622
H  -4.432432 -3.694519 -1.155205
H  -5.645496 -0.617348 1.648207
H  7.776493 -2.075264 -0.83622
