program: Gaussian 09
title: 000068788
version: EM64L-G09RevD.01
frameworkgroup: C1[X(C17H24N4O2S)]
method: RPBEPBE
basis: SDD
operation: Freq
keyword: #p
keyword: freq=noraman
keyword: PBEPBE/SDD
title: #p freq=noraman PBEPBE/SDD
converged: NO YES NO NO
title: Mulliken charges:
elementType: S O O N N N N C C C C C C C C C C C C C C C C C H H H H H H H H H H H H H H H H H H H H H H H H
charge: 1.062139 -0.544109 -0.543824 -0.132440 -0.544207 -0.404813 -0.248961 -0.189589 -0.053173 -0.471146 -0.155822 -0.619035 -0.449132 0.380951 -0.216433 0.372707 -0.650948 0.233852 -0.454198 -0.452142 -0.370080 -0.214305 -0.599938 -0.596789 0.260324 0.215175 0.223100 0.221953 0.296685 0.229131 0.233713 0.251694 0.201836 0.327545 0.236998 0.247507 0.197963 0.227860 0.264990 0.304139 0.228120 0.215451 0.274409 0.241014 0.224893 0.270928 0.224833 0.241174
chargesum: 0.00000
title: Mulliken charges with hydrogens summed into heavy atoms:
elementType: S O O N N N N C C C C C C C C C C C C C C C C C
charge: 1.062139 -0.544109 -0.543824 -0.132440 -0.216662 -0.100674 -0.248961 0.070736 0.162002 -0.026094 0.140863 -0.156192 0.004397 0.380951 -0.216433 0.372707 0.031520 0.233852 -0.226338 -0.187152 -0.141960 0.001146 0.140378 0.140146
polarizability: 3.14344269e+02 -6.66895068e+00 2.57826330e+02 -5.12247633e+00 1.80548413e+01 1.77436875e+02
1716.lowfreq: -9.1169 -7.5764 -6.4264 0.0011 0.0013 0.0018 13.7340 14.8969 33.1740
frequency: 11.8898 13.7149 33.1572 53.2031 67.6421 72.0366 108.1203 136.2710 147.3974 165.0966 199.4370 200.8881 202.7779 217.4845 224.9463 234.7472 245.6997 253.5725 279.9605 300.0330 306.3999 324.5076 331.4638 346.8406 377.9912 381.5760 388.1892 395.4363 420.2467 446.7321 449.8855 463.5988 497.7990 507.9169 511.9098 520.2284 536.0837 558.8410 592.6089 604.9921 620.7847 681.9748 730.9586 752.4732 764.6837 775.1701 787.5205 808.6402 815.7273 822.4003 843.8136 859.8977 878.0770 892.9538 902.2973 924.6389 949.0929 953.3096 969.8559 982.9777 1012.2480 1020.6409 1030.7907 1043.1722 1054.6297 1068.3399 1078.5404 1080.0987 1091.3413 1104.3126 1113.1859 1116.9661 1123.4178 1148.5319 1169.3611 1173.0797 1178.9569 1196.9172 1209.0523 1210.6068 1225.8050 1230.7530 1237.6235 1251.2286 1267.0930 1274.4532 1284.6310 1294.6909 1308.2059 1321.2775 1331.7482 1350.3296 1352.1580 1357.2138 1370.4993 1402.5715 1407.9292 1417.7034 1418.7228 1435.1911 1447.0632 1448.8776 1452.2047 1463.3145 1464.2983 1468.5321 1469.0850 1480.5641 1484.4129 1490.9023 1503.4055 1566.5407 1618.2514 1627.7989 2838.6562 2879.6027 2892.0685 2939.8931 2944.1193 2944.1663 2964.5093 2982.2287 3036.7630 3043.9915 3045.8299 3048.2899 3050.8866 3052.1955 3057.2496 3097.8601 3103.3941 3105.0629 3124.0279 3140.0554 3156.7139 3213.7483 3218.8354 3613.0859
redmass: 4.7196 4.5232 5.1355 3.2380 3.9684 3.8540 4.1019 7.4330 2.8209 3.8116 2.9000 3.4545 1.3990 2.7145 3.0256 1.3181 2.0134 3.2356 3.4473 2.7025 4.3787 2.9448 2.9352 5.0787 3.2634 3.0751 4.2594 3.5040 3.8424 3.7440 3.3811 3.6723 1.6467 5.4502 2.0045 4.6513 3.1641 3.9828 4.0127 4.0759 3.4846 3.6069 4.8158 1.5599 4.4359 2.1160 2.0642 2.1200 13.2351 5.0764 3.7795 4.3271 1.4340 2.3653 2.1132 2.5158 3.7330 1.3211 2.1334 2.2949 1.5038 2.0943 2.8077 2.2740 2.6551 1.7893 1.6526 1.5897 1.8632 2.2898 1.3851 1.4770 1.9949 1.7492 4.1172 1.5328 1.2874 1.5844 1.2699 1.6119 1.7171 1.7215 1.4366 1.8508 1.4405 1.5684 1.7711 1.8718 1.3318 1.4922 1.3438 1.9324 1.5206 1.5964 1.2386 1.1308 2.5266 1.1436 3.7700 1.1556 1.0502 1.0908 3.1077 1.2427 1.0454 1.0672 1.0880 1.0601 1.0538 1.0734 3.2414 6.8740 7.4861 8.1256 1.0803 1.0661 1.0582 1.0420 1.0597 1.0620 1.0656 1.0621 1.0861 1.0806 1.0919 1.0887 1.0924 1.0914 1.0999 1.1001 1.0987 1.0999 1.0855 1.0915 1.0982 1.0723 1.0982 1.0808
irintensity: 3.6953 2.0558 0.5407 0.0052 0.3196 6.9362 2.2082 2.6884 1.7198 2.2445 2.3485 6.2461 1.0732 1.7173 0.9038 3.1511 2.5685 3.1101 8.8586 3.1324 2.2679 8.1394 0.2555 5.7788 26.3093 7.1421 0.9451 25.3568 3.2668 21.2413 20.0169 4.6826 59.8430 122.8841 40.4245 6.2372 4.0517 4.0845 0.5470 6.5552 4.1223 4.3772 4.8619 75.1796 5.4964 34.2968 5.7622 1.2717 80.8382 16.7114 42.6206 38.6302 2.2047 4.3651 6.7931 88.4646 29.7565 0.9091 24.8561 2.5607 1.7139 13.2352 29.9386 11.6698 3.6900 4.9536 9.8398 8.5726 35.0179 13.5282 26.7233 3.3606 6.5167 4.2916 11.6177 17.3902 4.6272 12.6745 29.5405 22.7841 0.3030 11.4438 11.3118 0.7676 1.6399 1.3425 0.1945 27.2457 2.3111 11.6868 9.9949 16.6038 9.1899 7.3596 36.7539 17.5879 5.3531 2.0692 9.6045 0.9970 32.1428 6.6187 21.2903 18.4566 22.5996 2.3971 6.5468 8.8329 36.9479 24.0582 0.9226 3.9094 11.5621 7.1706 47.9237 39.6325 175.1538 32.0139 48.9164 22.4304 35.4425 29.6563 10.0873 19.0402 12.9128 43.4373 3.7974 41.4134 22.0021 26.2222 2.9539 3.3012 2.8633 23.4291 32.0083 153.9583 1.3436 67.9174
temp: 298.150 k
press: 1.00000 atm
elementType: 16 8 8 7 7 7 7 6 6 6 6 6 6 6 6 6 6 6 6 6 6 6 6 6 1 1 1 1 1 1 1 1 1 1 1 1 1 1 1 1 1 1 1 1 1 1 1 1
symmnumber: 1
zpe: 1029333.2 jmol-1
zpe.correction: 0.392052 hartree
zpe.thermalcorrener: 0.415454 hartree
zpe.thermalcorrenthalpy: 0.416398 hartree
zpe.thermalcorrgfe: 0.337922 hartree
zpe.sumelectzpe: -1427.725335 hartree
zpe.sumelectthermal: -1427.701933 hartree
zpe.sumelectthermalent: -1427.700989 hartree
zpe.sumelectthermalfe: -1427.779465 hartree
dipole: -6.4884 -1.4856 1.2047
dipole: 6.7645
quadrupole: -152.2641 -138.5563 -151.5889
quadrupole: -20.3110 0.8727 -1.2295
quadrupole: -4.7943 8.9135 -4.1191 -20.3110 0.8727 -1.2295
hfenergy: -1428.1173876 hartree
pointgroup: C01 [X(C17H24N4O2S1)]
dipole: 2.5731394 -0.5599149 -0.3850283 debye
polarizability: 314.5035226|7.4897227|259.6428414|1.8975188|-12.866614|175.4611105 unknown
InChI: InChI=1S/C17H24N4O2S/c1-20(2)24(22,23)19-12-8-14-13-5-4-6-15-17(13)11(9-18-15)7-16(14)21(3)10-12/h4-6,9,12,14,16,18-19H,7-8,10H2,1-3H3
charge 0 multiplicity 1
48 atoms
S  -4.25011 0.295945 -0.299435
O  -4.78593 0.165642 1.230046
O  -4.556811 1.598704 -1.217043
N  -0.533862 2.069954 0.371404
N  -2.372831 -0.000944 -0.299918
N  5.206117 0.353279 -0.643459
N  -4.964798 -1.172249 -1.217162
C  0.592009 -0.153112 0.152124
C  0.798263 1.385393 0.429809
C  -0.480441 -0.761643 1.084239
C  -1.777948 0.075771 1.073085
C  1.815706 2.030618 -0.564126
C  -1.442581 1.541561 1.423645
C  1.92453 -0.900326 0.2087
C  3.057155 -0.150979 -0.175501
C  3.09724 1.23251 -0.560275
C  -0.487367 3.550627 0.381962
C  4.373721 -0.694742 -0.225221
C  2.14929 -2.24597 0.561357
C  4.43083 1.52143 -0.840413
C  4.599389 -2.048767 0.118375
C  3.468493 -2.800196 0.511617
C  -4.526975 -1.161715 -2.635092
C  -4.676519 -2.427372 -0.48175
H  0.206877 -0.221837 -0.889217
H  1.228356 1.482842 1.462379
H  -0.71126 -1.795968 0.772957
H  -0.097001 -0.799187 2.123875
H  -2.50919 -0.332229 1.794038
H  2.009494 3.080993 -0.283072
H  1.351965 2.042407 -1.572646
H  -2.367614 2.145406 1.436752
H  -0.983036 1.593529 2.441219
H  -1.99427 0.80777 -0.851857
H  -1.521799 3.935095 0.379596
H  0.009269 3.932846 -0.524069
H  0.037291 3.968052 1.275132
H  1.321233 -2.890308 0.875894
H  4.902129 2.449727 -1.158802
H  6.212807 0.294991 -0.77797
H  5.593879 -2.507054 0.089979
H  3.606653 -3.851837 0.788458
H  -4.668801 -0.149227 -3.046881
H  -5.192968 -1.852915 -3.182384
H  -3.473075 -1.484504 -2.7746
H  -4.960214 -2.297783 0.575262
H  -3.614405 -2.746385 -0.554228
H  -5.321192 -3.211042 -0.918785
