program: Gaussian 09
title: 000073772
version: EM64L-G09RevD.01
frameworkgroup: C1[X(C11H20O2)]
method: RPBEPBE
basis: SDD
operation: Freq
keyword: #pfreq=noraman
keyword: PBEPBE/SDD
title: #p freq=noraman PBEPBE/SDD
converged: YES YES NO NO
title: Mulliken charges:
elementType: O O C C C C C C C C C C C H H H H H H H H H H H H H H H H H H H H
charge: -0.284031 -0.244852 0.044574 -0.433412 -0.448525 -0.399782 -0.395865 -0.387334 0.240482 -0.520862 -0.341627 -0.341231 -0.692999 0.229697 0.200146 0.236723 0.212683 0.205927 0.204974 0.199693 0.197048 0.205143 0.202837 0.190310 0.240726 0.237905 0.209649 0.208791 0.191311 0.192185 0.212106 0.212139 0.215468
chargesum: 0.00000
title: Mulliken charges with hydrogens summed into heavy atoms:
elementType: O O C C C C C C C C C C C
charge: -0.284031 -0.244852 0.274271 0.003457 -0.029915 0.004886 0.006326 0.005814 0.240482 -0.042231 0.076814 0.042265 -0.053286
polarizability: 1.59723633e+02 1.45653339e+00 1.09959961e+02 4.27960821e-01 2.93619610e+00 1.01222965e+02
1716.lowfreq: -22.3271 -15.5643 -8.6588 0.0005 0.0007 0.0008 6.3005 36.4112 52.8680
frequency: -20.4867 35.6757 52.6027 56.8851 90.7613 109.7627 119.9015 198.9964 213.7681 218.2346 233.7586 293.4187 326.4254 326.9130 396.6158 428.0706 444.0303 477.6757 546.6011 568.1155 668.5528 722.9635 786.4260 787.4774 790.0023 833.3935 864.8120 880.2574 895.2783 904.9951 918.7574 921.1431 932.3776 999.0121 1035.2039 1043.5487 1052.3853 1081.5112 1084.1474 1098.7893 1105.3600 1108.9209 1137.0209 1152.1701 1198.3540 1204.3868 1241.1182 1253.0199 1258.2079 1260.7596 1271.1828 1285.8941 1300.6471 1308.5399 1329.5233 1331.4159 1338.4587 1339.6917 1349.5904 1359.2095 1364.9826 1391.2797 1439.2878 1462.0804 1464.4288 1465.5548 1466.0772 1473.1882 1475.4823 1477.5135 1481.0237 1487.5707 1634.5524 2962.1516 2970.7025 2971.4738 2973.8084 2974.0897 2984.0409 2985.6585 2988.1243 2994.7027 3005.0837 3009.1258 3028.5293 3033.9073 3035.6716 3044.3771 3055.1994 3057.7542 3064.3714 3072.1761 3072.9097
redmass: 2.1372 2.5523 4.1022 4.9676 3.0765 2.0021 3.0464 2.8948 2.4970 2.8698 1.1091 3.5630 1.9357 5.0286 3.4468 2.9798 2.5183 1.9272 2.5908 2.7776 6.0308 1.1086 1.4575 1.3178 2.1495 2.6814 3.3082 1.7772 1.6665 1.8259 1.2850 1.8011 3.7190 2.7504 3.3521 1.9048 1.0879 1.3530 2.0410 2.6269 1.5154 2.6913 3.0833 2.3140 1.4987 1.4532 1.3114 1.2781 1.3417 1.3656 1.1807 1.0599 1.1973 1.3172 1.4946 1.3519 1.5467 1.4663 1.5530 1.5287 1.6682 1.2205 1.0866 1.0862 1.0898 1.0909 1.0711 1.0828 1.0663 1.0423 1.0973 1.0800 9.8218 1.0590 1.0659 1.0609 1.0623 1.0370 1.0611 1.0621 1.0643 1.0597 1.0998 1.0824 1.0989 1.0955 1.0982 1.1011 1.1020 1.1027 1.1023 1.1009 1.0994
irintensity: 0.0052 0.6489 0.5750 0.8472 1.2732 0.6703 1.2762 5.0197 0.8283 0.4104 0.0641 4.2297 1.9830 8.9661 3.3035 0.8501 1.8842 0.5225 0.8374 2.2174 3.4307 12.7597 0.7292 0.4558 2.3518 4.7777 6.9896 1.7647 15.4970 18.2159 4.3862 8.9190 50.6513 67.8088 34.3733 2.6428 0.2139 20.3858 0.8993 119.5641 0.5119 0.8209 266.5454 1.6734 0.3824 0.1793 0.6104 3.2062 32.3878 36.9015 0.4960 0.1593 1.4220 0.6067 37.6503 0.5583 7.6838 0.5934 1.2303 7.8612 2.1373 14.8152 23.1160 2.4557 7.8811 11.8034 0.9156 21.0338 4.3317 12.4400 3.0444 18.7617 154.2717 33.0708 33.1399 36.7047 29.9341 37.2620 2.9261 8.7085 18.6746 40.1964 10.2703 22.2120 0.1130 62.0359 63.4004 41.0329 26.2173 18.3204 65.0711 99.8026 53.2174
temp: 298.150 k
press: 1.00000 atm
elementType: 8 8 6 6 6 6 6 6 6 6 6 6 6 1 1 1 1 1 1 1 1 1 1 1 1 1 1 1 1 1 1 1 1
symmnumber: 1
zpe: 765248.7 jmol-1
zpe.correction: 0.291468 hartree
zpe.thermalcorrener: 0.305291 hartree
zpe.thermalcorrenthalpy: 0.306235 hartree
zpe.thermalcorrgfe: 0.249907 hartree
zpe.sumelectzpe: -580.579066 hartree
zpe.sumelectthermal: -580.565242 hartree
zpe.sumelectthermalent: -580.564298 hartree
zpe.sumelectthermalfe: -580.620627 hartree
dipole: -0.9775 -1.0956 -1.1782
dipole: 1.8825
quadrupole: -72.2199 -82.4024 -81.8780
quadrupole: -2.1630 -2.1683 -3.4616
quadrupole: 6.6136 -3.5690 -3.0446 -2.1630 -2.1683 -3.4616
hfenergy: -580.8705334 hartree
pointgroup: C01 [X(C11H20O2)]
dipole: -0.392653 0.2835669 0.5603318 debye
polarizability: 159.7594481|-0.067795|107.8134665|-0.786159|4.7360411|103.3336438 unknown
InChI: InChI=1S/C11H20O2/c1-2-3-9-11(12)13-10-7-5-4-6-8-10/h10H,2-9H2,1H3
charge 0 multiplicity 1
33 atoms
O  -0.228716 0.47726 0.47676
O  0.839101 -0.719313 -1.222339
C  -1.5718 0.113345 -0.095498
C  -1.980418 -1.286061 0.398145
C  -2.549589 1.202012 0.366405
C  -3.417304 -1.621981 -0.075855
C  -3.989066 0.865979 -0.10213
C  -4.4254 -0.539256 0.378674
C  0.899197 -0.027993 -0.178224
C  2.165228 0.38174 0.558978
C  3.454476 -0.119915 -0.119218
C  4.722023 0.266239 0.674986
C  6.01727 -0.244475 0.008019
H  -1.47378 0.104708 -1.198935
H  -1.940874 -1.29561 1.50569
H  -1.262402 -2.038627 0.025672
H  -2.227807 2.185434 -0.02359
H  -2.519914 1.260428 1.472348
H  -3.713844 -2.6151 0.311569
H  -3.431116 -1.694846 -1.182889
H  -4.035303 0.903601 -1.210188
H  -4.689166 1.637064 0.27173
H  -5.437566 -0.774706 -0.002689
H  -4.488763 -0.5421 1.486462
H  2.168335 1.485263 0.654516
H  2.091979 -0.003805 1.595535
H  3.404613 -1.219882 -0.233552
H  3.51539 0.28924 -1.146063
H  4.650181 -0.142737 1.704029
H  4.770393 1.36953 0.781617
H  6.006427 -1.34687 -0.084084
H  6.130997 0.174251 -1.009614
H  6.912417 0.037682 0.592135
