program: Gaussian 09
title: 000068787
version: EM64L-G09RevD.01
frameworkgroup: C1[X(C17H16ClN3O2)]
method: RPBEPBE
basis: SDD
operation: Freq
keyword: #p
keyword: freq=noraman
keyword: PBEPBE/SDD
title: #p freq=noraman PBEPBE/SDD
converged: YES YES NO NO
title: Mulliken charges:
elementType: Cl O O N N N C C C C C C C C C C C C C C C C C H H H H H H H H H H H H H H H H
charge: -0.047614 -0.241327 -0.294470 -0.183829 -0.224455 -0.641515 -0.410276 0.473609 0.284899 -0.519000 0.430815 0.161454 -0.426995 -0.322053 0.237210 -0.395008 -0.394850 -0.636245 -0.139020 -0.240009 -0.223876 -0.244548 -0.245628 0.260908 0.260483 0.303438 0.266494 0.247505 0.241324 0.277729 0.227816 0.281384 0.238534 0.260581 0.228979 0.237165 0.233314 0.338447 0.338629
chargesum: 0.00000
title: Mulliken charges with hydrogens summed into heavy atoms:
elementType: Cl O O N N N C C C C C C C C C C C C C C C C C
charge: -0.047614 -0.241327 -0.294470 -0.183829 -0.224455 0.035561 -0.149367 0.473609 0.284899 0.044921 0.430815 0.161454 -0.160500 -0.074548 0.237210 -0.153684 -0.117121 0.111490 -0.139020 0.020572 0.005103 -0.007384 -0.012315
polarizability: 2.66999121e+02 8.28623535e+00 1.90938989e+02 -1.98808258e+01 1.00044518e+00 1.89416068e+02
1716.lowfreq: -5.2066 -4.4290 0.0011 0.0014 0.0016 4.7600 21.8979 45.4934 52.2353
frequency: 21.7212 45.4859 52.2303 60.6683 68.3670 86.6796 101.5939 113.6047 126.7300 143.3376 173.2374 199.7007 224.8706 235.9329 256.0996 278.6743 301.3529 339.5569 348.1802 357.4386 384.4998 403.3578 416.4433 433.6871 462.2309 484.9381 496.0559 502.3893 511.3770 549.3090 551.1120 596.7936 614.0138 621.8968 643.6125 660.9845 697.5714 710.4855 712.0891 730.5297 744.8647 751.9767 822.9589 830.6537 856.3697 861.0762 879.4574 895.5933 910.4048 936.5065 949.6427 960.5222 985.2365 989.5713 1003.3417 1025.0999 1031.4160 1055.8180 1081.2862 1087.2442 1093.4216 1116.1885 1136.7400 1140.7674 1163.5401 1173.7454 1189.7599 1201.1237 1211.5534 1235.3694 1251.3477 1282.7983 1299.2195 1321.8913 1329.5756 1334.7397 1347.6764 1375.0269 1383.3254 1403.8423 1407.0406 1422.0009 1436.3290 1463.2688 1475.5572 1478.8262 1480.4864 1497.8138 1577.7098 1588.4571 1591.6780 1592.5430 1609.1697 1610.4110 1640.4637 2977.9361 2980.2598 2986.6110 3080.0520 3110.9960 3117.1806 3125.0756 3130.0243 3140.9076 3148.8054 3151.4589 3155.4305 3165.9251 3177.6085 3517.3407 3670.6919
redmass: 5.5909 6.1240 4.5733 6.2911 7.5142 3.4987 5.5453 1.4309 4.9037 2.8181 5.7245 5.7898 5.0056 5.0470 6.6942 5.3605 5.0245 6.1399 5.9181 4.2410 3.8598 2.8591 3.9250 1.9145 1.9078 2.5698 3.4351 6.2827 4.6445 2.0302 1.6001 4.6487 6.3539 6.0747 5.5843 5.2684 4.3828 5.8311 2.3372 4.7294 3.4088 2.3214 1.5893 2.7101 3.3064 1.2540 4.0276 1.7277 3.6971 1.4959 1.3513 2.2974 1.3863 5.8285 1.3192 2.4208 3.9648 1.9799 1.8908 1.9160 1.9378 1.3626 1.9328 1.8038 2.9529 1.0515 1.1576 2.3259 2.7038 1.8879 1.4539 2.5352 1.4253 1.5273 2.0002 1.6762 1.7311 5.4957 6.7506 3.9989 3.2955 1.2095 2.1869 1.0838 1.1745 2.1566 2.2760 1.0703 7.4326 2.1863 4.6171 6.4369 6.3676 7.1491 2.2418 1.0705 1.0816 1.0381 1.0958 1.0929 1.0871 1.1019 1.0865 1.0915 1.0925 1.0952 1.0884 1.1013 1.0970 1.0465 1.1023
irintensity: 0.1938 0.5830 0.4310 0.5923 3.0697 1.0227 6.4745 0.6644 2.1349 1.5608 3.4325 0.8519 6.7048 1.5496 0.7986 2.2854 2.4469 8.8502 4.7459 7.0427 2.2720 0.3547 0.9496 28.3800 13.4965 26.7376 12.3551 31.9551 3.7655 112.3443 75.1571 9.3097 0.3407 1.2177 12.1579 1.0300 7.9233 24.3263 53.9813 4.1036 15.8532 37.2326 19.5037 31.4093 2.9032 0.9243 28.4301 7.6197 3.5106 3.0576 0.3663 11.6226 1.1470 1.0548 0.5512 10.1509 11.5221 11.8365 66.1650 18.4646 75.7480 1.3411 20.7082 30.1251 3.0115 0.0490 4.3811 19.3264 33.4475 41.0430 45.9433 40.9110 8.9537 5.7605 44.7501 22.9933 37.7748 27.3954 6.7445 352.0973 22.8021 24.9695 19.8576 21.3049 40.0923 20.6500 154.0094 32.1645 15.1635 210.3594 143.8594 35.7617 89.1084 114.3015 257.7383 33.7972 10.5934 39.8727 19.8259 4.3077 5.1133 1.8591 0.3039 13.5317 1.3025 19.3206 3.8665 23.3970 3.2294 31.1843 60.2264
temp: 298.150 k
press: 1.00000 atm
elementType: 17 8 8 7 7 7 6 6 6 6 6 6 6 6 6 6 6 6 6 6 6 6 6 1 1 1 1 1 1 1 1 1 1 1 1 1 1 1 1
symmnumber: 1
zpe: 788803.2 jmol-1
zpe.correction: 0.300439 hartree
zpe.thermalcorrener: 0.320900 hartree
zpe.thermalcorrenthalpy: 0.321844 hartree
zpe.thermalcorrgfe: 0.250374 hartree
zpe.sumelectzpe: -1430.563322 hartree
zpe.sumelectthermal: -1430.542861 hartree
zpe.sumelectthermalent: -1430.541917 hartree
zpe.sumelectthermalfe: -1430.613387 hartree
dipole: 2.1306 5.4404 -0.8004
dipole: 5.8973
quadrupole: -148.2583 -151.2019 -132.0806
quadrupole: -13.0911 16.3587 1.9976
quadrupole: -4.4113 -7.3550 11.7663 -13.0911 16.3587 1.9976
hfenergy: -1430.8637612 hartree
pointgroup: C01 [X(C17H16Cl1N3O2)]
dipole: -0.8633932 2.0146193 -0.760971 debye
polarizability: 255.3360496|-23.3153071|192.8679953|-26.1018512|4.9667342|199.1501335 unknown
InChI: InChI=1S/C17H16ClN3O2/c1-20-14-8-7-12(18)9-13(14)16(11-5-3-2-4-6-11)21(17(19)23)10-15(20)22/h2-9,16H,10,19H2,1H3
charge 0 multiplicity 1
39 atoms
Cl -4.737834 1.112754 2.281143
O  1.266486 -2.517257 -1.92185
O  2.486541 -2.454551 2.400405
N  1.029209 -1.115266 1.137246
N  -0.60339 -1.179644 -1.524748
N  2.62006 -0.131881 2.593784
C  0.3273 0.177788 0.976872
C  -1.148725 -0.019618 0.611209
C  -1.559139 -0.613258 -0.620883
C  0.522517 -2.292355 0.409607
C  1.025293 1.156127 -0.004967
C  0.445222 -2.01713 -1.099487
C  -2.135443 0.479656 1.493174
C  -2.93462 -0.626822 -0.966588
C  2.075511 -1.303762 2.060718
C  0.49436 2.462846 -0.163182
C  2.198269 0.801292 -0.712889
C  -0.762841 -0.955016 -2.97958
C  -3.494358 0.439424 1.132966
C  -3.910613 -0.094961 -0.100206
C  1.121629 3.395638 -1.016719
C  2.8245 1.734001 -1.571884
C  2.291337 3.033217 -1.726404
H  0.331796 0.665683 1.972086
H  -0.466543 -2.605976 0.798631
H  1.237235 -3.112372 0.574806
H  -1.837227 0.915546 2.452246
H  -3.250721 -1.073713 -1.91394
H  -0.417953 2.747917 0.375713
H  2.616354 -0.205525 -0.605968
H  -1.506761 -1.643804 -3.422403
H  0.209268 -1.154396 -3.456007
H  -1.069215 0.087551 -3.162315
H  -4.969647 -0.113976 -0.372144
H  0.700733 4.401181 -1.129015
H  3.726881 1.441087 -2.119832
H  2.779306 3.755025 -2.390653
H  3.355576 -0.269773 3.28405
H  2.575447 0.762821 2.106608
