program: Gaussian 09
title: 000073780
version: EM64L-G09RevD.01
frameworkgroup: C1[X(C12H13N3)]
method: RPBEPBE
basis: SDD
operation: Freq
keyword: #pfreq=noraman
keyword: PBEPBE/SDD
title: #p freq=noraman PBEPBE/SDD
converged: NO YES NO NO
title: Mulliken charges:
elementType: N N N C C C C C C C C C C C C H H H H H H H H H H H H H
charge: -0.149185 -0.008922 -0.008796 -0.448984 -0.449026 0.460888 -0.421857 -0.422001 -0.365551 -0.365526 -0.237936 -0.237964 -0.263466 -0.149233 -0.149284 0.247079 0.249574 0.247092 0.249559 0.257031 0.283242 0.257147 0.283300 0.228616 0.228631 0.226509 0.226510 0.232551
chargesum: 0.00000
title: Mulliken charges with hydrogens summed into heavy atoms:
elementType: N N N C C C C C C C C C C C C
charge: -0.149185 -0.008922 -0.008796 0.047669 0.047626 0.460888 0.118417 0.118446 -0.136935 -0.136895 -0.011427 -0.011454 -0.030915 -0.149233 -0.149284
polarizability: 1.69831875e+02 2.38283314e-02 1.81610097e+02 1.87211115e+01 -1.06243221e-02 8.48349774e+01
1716.lowfreq: -6.6631 -0.0004 0.0001 0.0004 7.1012 12.1362 29.1892 43.3199 44.9857
frequency: 29.1861 43.3146 44.9552 52.7440 97.9116 118.6834 145.7854 164.4501 197.9250 243.7596 285.1757 362.0881 365.7561 383.1327 399.0539 422.2259 461.6148 465.7620 514.1612 565.5008 587.8186 615.2012 696.4968 746.6104 754.4292 771.9520 781.4353 815.8772 876.1077 936.6843 943.4367 958.4820 968.3751 978.2467 981.2943 990.7282 993.6415 1024.4622 1032.0464 1084.8616 1096.3582 1163.3269 1176.6279 1200.4522 1207.8233 1234.3828 1277.0865 1278.0345 1283.4551 1301.9268 1341.6852 1356.2449 1361.1713 1381.2256 1387.8134 1446.9477 1450.3299 1451.7721 1486.3586 1496.2503 1511.4901 1581.5287 1619.4127 2198.5232 2198.8356 3003.1570 3005.0278 3013.0062 3016.0495 3054.1073 3057.1475 3076.4470 3080.3901 3128.4799 3134.1252 3153.4694 3157.3521 3172.4931
redmass: 9.4295 6.1458 6.3341 3.5492 2.8333 3.0528 6.7482 5.7285 4.1919 5.4605 2.8253 2.8603 3.8616 4.2893 3.1427 3.0842 5.8191 5.1525 3.0462 3.7755 5.2917 6.4052 1.8625 3.4655 1.8473 1.2022 1.3530 1.2510 1.4406 4.9428 4.6931 1.4679 3.1666 5.4743 1.3101 3.9271 4.7908 1.8106 2.2956 1.8313 1.7099 1.5068 1.0521 1.4421 1.1205 1.7418 1.3153 1.3366 1.2885 1.2058 1.3826 1.2333 1.3564 6.6287 1.6871 1.3862 1.0883 1.6354 1.1004 2.0762 1.1977 5.9819 6.0191 12.4193 12.4212 1.0598 1.0598 1.0592 1.0603 1.1021 1.1012 1.1048 1.1045 1.0846 1.0880 1.0911 1.0948 1.1010
irintensity: 4.5956 3.3938 3.3441 2.9372 0.9543 4.6213 0.0008 14.2841 0.2162 0.0063 0.7183 0.1637 3.2995 5.8234 0.1463 0.0367 4.5832 21.3103 4.7547 0.5126 12.4740 0.7317 38.4025 4.8650 87.3117 2.8351 13.6859 0.0049 5.4372 5.8280 1.9746 1.8931 8.3748 8.2133 0.1643 18.5455 13.1346 16.7756 17.0516 0.0536 1.0660 61.9642 1.2940 35.3691 5.5176 40.0240 11.5259 0.3544 51.1402 10.1441 4.6106 46.6534 93.7118 5.8619 24.2641 14.5901 0.4085 10.2131 27.2653 118.3820 55.9755 12.2983 160.9387 31.9887 13.8342 3.4076 2.7520 40.5596 11.9667 1.1266 1.5914 12.7765 21.2060 9.2167 2.4150 29.3102 43.1827 7.1124
temp: 298.150 k
press: 1.00000 atm
elementType: 7 7 7 6 6 6 6 6 6 6 6 6 6 6 6 1 1 1 1 1 1 1 1 1 1 1 1 1
symmnumber: 1
zpe: 588812.1 jmol-1
zpe.correction: 0.224267 hartree
zpe.thermalcorrener: 0.238815 hartree
zpe.thermalcorrenthalpy: 0.239759 hartree
zpe.thermalcorrgfe: 0.180516 hartree
zpe.sumelectzpe: -628.204738 hartree
zpe.sumelectthermal: -628.190190 hartree
zpe.sumelectthermalent: -628.189246 hartree
zpe.sumelectthermalfe: -628.248489 hartree
dipole: 0.0004 2.8598 0.0069
dipole: 2.8598
quadrupole: -126.1668 -97.3334 -88.3336
quadrupole: 0.0233 -3.3916 -0.0254
quadrupole: -22.2222 6.6112 15.6110 0.0233 -3.3916 -0.0254
hfenergy: -628.429005 hartree
pointgroup: C01 [X(C12H13N3)]
dipole: 0.0021831 -1.1251195 -0.001305 debye
polarizability: 169.7713043|-0.068907|181.6097064|-18.8581692|-0.1666933|84.8959382 unknown
InChI: InChI=1S/C12H13N3/c13-8-4-10-15(11-5-9-14)12-6-2-1-3-7-12/h1-3,6-7H,4-5,10-11H2
charge 0 multiplicity 1
28 atoms
N  -0.001308 0.40599 -0.002253
N  -4.390817 2.629831 0.166795
N  4.379873 2.650346 -0.1694
C  -1.176311 1.161442 0.440611
C  1.17038 1.165718 -0.44657
C  0.00217 -1.009688 0.000018
C  -2.256554 1.286338 -0.689379
C  2.249599 1.298286 0.68354
C  -1.143294 -1.751521 0.423895
C  1.151411 -1.747182 -0.421228
C  -1.13071 -3.161352 0.42659
C  1.146064 -3.157056 -0.418746
C  0.009542 -3.881833 0.005277
C  -3.444876 2.025277 -0.237574
C  3.434812 2.04122 0.230149
H  -0.861836 2.176274 0.742044
H  -1.631641 0.697512 1.333611
H  0.851424 2.178399 -0.750555
H  1.62816 0.701705 -1.338252
H  -1.81656 1.802544 -1.562822
H  -2.557553 0.277833 -1.027016
H  1.806899 1.81485 1.555408
H  2.554886 0.292035 1.02401
H  -2.052076 -1.241414 0.757259
H  2.057551 -1.233675 -0.756559
H  -2.026257 -3.698331 0.759208
H  2.044362 -3.690644 -0.749399
H  0.012358 -4.976205 0.007339
