program: Gaussian 09
title: 000073776
version: EM64L-G09RevD.01
frameworkgroup: C1[X(C10H16O2)]
method: RPBEPBE
basis: SDD
operation: Freq
keyword: #pfreq=noraman
keyword: PBEPBE/SDD
title: #p freq=noraman PBEPBE/SDD
converged: NO YES NO NO
title: Mulliken charges:
elementType: O O C C C C C C C C C C H H H H H H H H H H H H H H H H
charge: -0.293108 -0.272116 -0.391941 -0.395336 -0.398506 -0.569608 -0.581188 0.558763 -0.536915 0.255847 -0.221697 -0.679256 0.189223 0.213248 0.208310 0.210338 0.209275 0.207942 0.209389 0.223878 0.288006 0.198211 0.244250 0.228239 0.228191 0.212612 0.227450 0.226495
chargesum: 0.00000
title: Mulliken charges with hydrogens summed into heavy atoms:
elementType: O O C C C C C C C C C C
charge: -0.293108 -0.272116 0.010531 0.023312 0.018712 -0.136341 -0.094971 0.558763 -0.292665 0.255847 0.234733 -0.012698
polarizability: 1.55726510e+02 7.97871511e+00 1.17032218e+02 5.16529958e+00 3.23100419e+00 8.16966256e+01
1716.lowfreq: -14.1375 -0.0002 0.0003 0.0004 3.2296 11.8261 24.8277 55.6392 68.1115
frequency: 23.2542 55.6290 68.1059 92.4990 109.5905 161.2780 215.7625 246.0963 263.9784 285.6190 317.4122 352.9004 372.1137 421.2071 469.5042 496.8410 649.9743 666.1435 688.0571 765.4139 781.4514 797.9668 806.5239 849.0892 852.7354 879.6122 898.1470 927.0716 932.6298 984.2861 1029.4089 1037.2333 1079.3184 1090.6680 1102.3781 1111.0989 1125.5650 1134.4404 1172.5815 1231.8018 1245.3633 1248.0823 1253.2349 1266.6425 1305.7801 1311.0135 1327.6906 1343.4501 1344.0861 1356.8742 1374.3541 1397.6251 1455.4227 1461.9479 1463.0589 1464.0897 1472.3545 1473.9907 1476.5713 1486.8995 1580.2116 1655.6839 2952.4227 2959.0403 2967.2511 2979.3471 2980.6888 2992.7403 3009.0012 3030.2512 3038.1404 3043.1461 3050.0206 3065.8933 3089.2076 3103.4338 3111.5458 3125.4658
redmass: 3.1063 3.2590 3.1985 3.2828 2.6525 2.5056 2.1382 2.2060 1.8521 2.3745 3.5359 2.6288 3.1456 3.0040 1.6715 3.6321 2.8607 4.4701 4.2732 3.8843 1.4886 1.1002 3.6189 2.3200 1.5484 1.6657 2.4772 2.9016 1.4520 2.6217 2.6576 2.0656 1.2049 1.5146 1.8675 2.2250 1.9316 1.4613 1.9231 1.4086 1.1439 1.8442 1.4168 1.3527 1.3160 1.3440 1.3175 1.5687 1.4810 1.4490 1.5628 1.2705 1.0948 1.0860 1.0711 1.0633 1.0795 1.0625 1.0963 1.0710 9.0399 7.6076 1.0670 1.0671 1.0625 1.0619 1.0612 1.0356 1.0582 1.0966 1.0995 1.0993 1.1035 1.1062 1.0985 1.1027 1.0910 1.0886
irintensity: 0.5911 0.0718 0.8171 0.7286 1.7175 1.8821 2.0112 1.7931 1.9629 1.6748 8.0924 4.6003 2.9153 0.0493 2.4389 1.3124 2.3937 4.9775 3.1572 7.6095 0.3277 3.9639 2.8890 6.6478 11.4448 16.6150 34.7468 45.7236 6.6416 29.8670 103.5419 9.0856 2.8657 14.4632 6.7585 2.1998 0.8082 5.3133 104.1080 6.1453 2.7706 157.3477 40.8354 50.3340 1.8708 7.6331 2.0482 1.5682 1.4986 2.0804 6.4166 19.8736 8.4117 6.7904 11.1625 14.7228 16.0758 7.6398 3.9105 12.1963 148.7473 264.8366 6.5073 39.0718 37.8508 34.3583 36.9167 20.5089 22.1558 64.4358 55.1028 6.1432 92.8324 6.9899 35.1744 48.5938 3.7106 10.4532
temp: 298.150 k
press: 1.00000 atm
elementType: 8 8 6 6 6 6 6 6 6 6 6 6 1 1 1 1 1 1 1 1 1 1 1 1 1 1 1 1
symmnumber: 1
zpe: 632868.9 jmol-1
zpe.correction: 0.241047 hartree
zpe.thermalcorrener: 0.253783 hartree
zpe.thermalcorrenthalpy: 0.254727 hartree
zpe.thermalcorrgfe: 0.200636 hartree
zpe.sumelectzpe: -540.160390 hartree
zpe.sumelectthermal: -540.147654 hartree
zpe.sumelectthermalent: -540.146710 hartree
zpe.sumelectthermalfe: -540.200801 hartree
dipole: 1.9200 2.7637 0.5097
dipole: 3.4036
quadrupole: -66.0596 -77.8804 -72.7660
quadrupole: -9.5844 -0.2383 -1.3436
quadrupole: 6.1757 -5.6451 -0.5307 -9.5844 -0.2383 -1.3436
hfenergy: -540.401437 hartree
pointgroup: C01 [X(C10H16O2)]
dipole: 0.7507265 -0.9591255 -0.5564071 debye
polarizability: 155.7021643|-6.1252564|110.9293316|-7.1874826|13.8440584|87.8238577 unknown
InChI: InChI=1S/C10H16O2/c1-2-12-10(11)8-9-6-4-3-5-7-9/h8H,2-7H2,1H3
charge 0 multiplicity 1
28 atoms
O  -1.953821 -0.179388 0.037328
O  -2.349839 1.797084 1.201112
C  3.282771 -1.234564 -0.001137
C  3.338947 0.126783 0.729232
C  1.835303 -1.773106 -0.062904
C  2.365787 1.152708 0.079284
C  0.862665 -0.742736 -0.710889
C  0.949484 0.597991 -0.004442
C  -0.082759 1.30476 0.557932
C  -1.531062 1.021088 0.63675
C  -3.421112 -0.450017 0.118806
C  -3.662259 -1.785244 -0.579478
H  3.671803 -1.112039 -1.033429
H  3.9422 -1.96581 0.504991
H  4.367847 0.534514 0.714184
H  3.059483 -0.012719 1.79262
H  1.482814 -2.005791 0.961796
H  1.798453 -2.717248 -0.639294
H  2.726366 1.364687 -0.95015
H  2.383941 2.107379 0.636006
H  -0.167505 -1.124139 -0.715982
H  1.175518 -0.594583 -1.767259
H  0.149289 2.260493 1.045566
H  -3.714782 -0.468923 1.183945
H  -3.957881 0.384899 -0.367057
H  -4.739658 -2.031251 -0.554041
H  -3.341566 -1.742187 -1.634716
H  -3.109524 -2.599241 -0.079273
