program: Gaussian 09
title: 000068776
version: EM64L-G09RevD.01
frameworkgroup: C1[X(C13H16O3)]
method: RPBEPBE
basis: SDD
operation: Freq
keyword: #pfreq=noraman
keyword: PBEPBE/SDD
title: #p freq=noraman PBEPBE/SDD
converged: YES YES NO NO
title: Mulliken charges:
elementType: O O O C C C C C C C C C C C C C H H H H H H H H H H H H H H H H
charge: -0.474466 -0.403713 -0.262008 0.147467 -0.249959 -0.480574 -0.428282 -0.392827 -0.398704 0.390515 0.181587 -0.388945 -0.404218 -0.248889 -0.223600 -0.244942 0.239726 0.216255 0.235186 0.229137 0.210026 0.198854 0.231962 0.210540 0.191414 0.360956 0.221730 0.278553 0.223690 0.224711 0.381354 0.227464
chargesum: 0.00000
title: Mulliken charges with hydrogens summed into heavy atoms:
elementType: O O O C C C C C C C C C C C C C
charge: -0.113510 -0.022359 -0.262008 0.147467 -0.010233 -0.029133 0.010880 0.037989 0.003250 0.390515 0.181587 -0.167215 -0.125666 -0.025199 0.001111 -0.017478
polarizability: 1.73151671e+02 -5.70029537e+00 1.21470386e+02 -2.75004717e+00 -1.09640918e+01 1.29791004e+02
1716.lowfreq: -5.5750 0.0007 0.0007 0.0009 4.9932 14.6772 22.0234 49.0579 67.8105
frequency: 21.6002 49.0447 67.7892 110.3069 135.5123 157.2703 217.8066 241.4059 256.7593 292.6423 314.5764 329.8860 340.3877 373.9698 403.3476 446.4339 478.0555 516.3131 545.1884 596.2351 610.1276 616.4798 621.2887 649.6308 706.4725 710.2269 727.9956 765.8897 791.6891 835.9449 851.7784 856.5186 911.4759 917.6777 923.4686 948.2864 963.9587 982.0937 989.4645 999.2048 1002.2036 1031.1304 1034.6935 1060.6774 1074.9486 1081.1081 1104.0978 1121.0574 1141.6363 1170.9438 1189.8462 1194.9164 1205.9194 1230.7311 1259.7668 1269.5163 1289.0116 1316.6433 1326.1440 1333.5158 1342.4649 1351.6929 1352.8199 1369.3678 1379.0839 1432.8992 1451.3133 1453.4780 1464.0665 1469.1895 1479.1005 1588.9593 1610.9711 1626.9487 2964.0009 2987.0629 2995.3084 2996.3586 3033.2436 3038.4871 3050.2623 3061.0249 3067.3249 3118.8907 3127.1617 3140.0675 3155.0380 3166.2067 3398.8285 3496.6473
redmass: 3.9342 6.8187 6.7555 3.1133 3.5126 4.7794 3.0672 4.9779 3.6441 3.4437 3.4310 2.7288 7.6043 3.2810 2.8424 3.2841 2.1889 2.9524 3.2181 1.2375 1.3979 5.6411 3.1244 3.9969 2.1103 2.5365 3.4209 1.8925 2.0521 1.9804 2.9024 1.2549 1.6325 2.8744 1.6002 2.6486 2.4682 1.3750 5.8190 3.2538 1.3625 2.1573 1.9043 1.9103 2.1205 1.7244 1.8559 1.9809 1.5775 1.0584 1.1961 1.6645 2.0647 1.5695 1.4203 1.3161 1.2503 1.3407 1.3104 1.3431 1.4467 1.4608 2.1677 1.5605 6.4397 2.2302 1.0894 1.0865 1.0841 1.0955 2.1892 6.1143 6.1252 7.4053 1.0638 1.0613 1.0638 1.0599 1.0958 1.0860 1.0992 1.1022 1.1016 1.0847 1.0875 1.0932 1.0957 1.0992 1.0655 1.0637
irintensity: 0.2275 0.7981 0.3081 0.5478 1.8260 0.4166 0.4964 1.1482 0.6655 0.8862 6.2279 2.5597 6.2992 2.2483 0.4735 0.6785 7.0462 4.1941 33.8022 178.7901 83.7683 7.5471 8.5280 25.9588 74.5400 50.8913 5.4243 45.9816 0.8365 9.1552 4.5255 0.6346 9.9566 6.8786 3.4503 7.5464 14.6928 0.3071 0.4242 42.1105 3.2757 18.9082 2.7074 118.3363 139.7149 8.1571 5.4938 35.9272 9.2305 0.7782 4.2893 0.2123 12.2026 8.2889 10.1542 5.6466 9.2967 0.6768 21.5767 3.0846 1.9052 0.5586 71.4006 55.0053 2.1794 9.2172 4.4946 15.0000 13.3578 7.6440 15.4607 2.2667 4.9512 154.7604 37.4817 25.3515 26.0121 41.0257 61.2183 4.9579 20.5351 3.3872 57.9971 5.6933 4.0847 34.5656 21.2998 18.2336 88.3544 22.7758
temp: 298.150 k
press: 1.00000 atm
elementType: 8 8 8 6 6 6 6 6 6 6 6 6 6 6 6 6 1 1 1 1 1 1 1 1 1 1 1 1 1 1 1 1
symmnumber: 1
zpe: 693122.2 jmol-1
zpe.correction: 0.263996 hartree
zpe.thermalcorrener: 0.278312 hartree
zpe.thermalcorrenthalpy: 0.279256 hartree
zpe.thermalcorrgfe: 0.222181 hartree
zpe.sumelectzpe: -729.474545 hartree
zpe.sumelectthermal: -729.460229 hartree
zpe.sumelectthermalent: -729.459285 hartree
zpe.sumelectthermalfe: -729.516361 hartree
dipole: 0.3887 1.0905 -2.1579
dipole: 2.4488
quadrupole: -87.1886 -90.6035 -96.6574
quadrupole: -0.0148 -1.7662 -1.2075
quadrupole: 4.2946 0.8796 -5.1743 -0.0148 -1.7662 -1.2075
hfenergy: -729.7385411 hartree
pointgroup: C01 [X(C13H16O3)]
dipole: -0.1235494 0.1914129 0.9361129 debye
polarizability: 173.1469293|5.9919668|116.380419|-2.2375161|7.1609563|134.8857123 unknown
InChI: InChI=1S/C13H16O3/c14-12(15)11-8-4-5-9-13(11,16)10-6-2-1-3-7-10/h1-3,6-7,11,14,16H,4-5,8-9H2
charge 0 multiplicity 1
32 atoms
O  -0.866802 -0.21631 -1.759066
O  -0.857491 2.685852 1.471259
O  -0.705169 2.425486 -0.822034
C  -0.530954 -0.496086 -0.352032
C  -1.335856 0.485825 0.576991
C  -1.001768 -1.952942 -0.097989
C  -2.874235 0.322922 0.366248
C  -2.527406 -2.11984 -0.265177
C  -3.303283 -1.135792 0.638909
C  0.992938 -0.395917 -0.125063
C  -0.930923 1.920499 0.30965
C  1.55377 -0.271859 1.172992
C  1.869841 -0.500925 -1.234163
C  2.954665 -0.241555 1.355416
C  3.270195 -0.471085 -1.05362
C  3.820112 -0.339637 0.24223
H  -1.115072 0.259808 1.634706
H  -0.68911 -2.2508 0.922438
H  -0.458929 -2.604374 -0.807224
H  -3.124863 0.593468 -0.676364
H  -3.409569 1.019162 1.03916
H  -2.813341 -3.163169 -0.030572
H  -2.790418 -1.931748 -1.322585
H  -4.392318 -1.235318 0.468375
H  -3.120593 -1.382006 1.705958
H  -0.730521 0.764415 -1.901901
H  0.907515 -0.199778 2.055613
H  1.435755 -0.604569 -2.233561
H  3.368705 -0.141156 2.365329
H  3.931996 -0.551039 -1.923741
H  -0.610462 3.62281 1.237289
H  4.906591 -0.315241 0.38313
