program: Gaussian 09
title: opt freq
version: AM64L-G09RevB.01
method: RTPSSTPSS
basis: SVP
operation: Freq
keyword: #P
keyword: Geom=AllCheck
keyword: Guess=TCheck
keyword: SCRF=Check
keyword: GenChk
keyword: RTPSSTPSS/SVP
keyword: Freq
multiplicity: 1
elementType: C C C C C C H H H H C C H H H O H C F F F
converged: YES YES YES YES
title: Mulliken atomic charges:
charge: -0.040131 -0.175829 0.056483 -0.141853 -0.049829 -0.216079 -0.016944 -0.027793 -0.020769 -0.016733 -0.163428 0.061806 0.008819 0.019760 0.009470 -0.299425 0.186204 0.504254 -0.218919 -0.209433 -0.249631
chargesum: -1.00000
title: Mulliken charges with hydrogens summed into heavy atoms:
elementType: C C C C C C C C O C F F F
charge: -0.057075 -0.203622 0.056483 -0.162622 -0.066562 -0.216079 -0.163428 0.099855 -0.113220 0.504254 -0.218919 -0.209433 -0.249631
polarizability: 2.97091855e+02 1.39212746e+01 1.53547003e+02 4.45414718e+01 2.16077655e+00 9.08831994e+01
1716.lowfreq: -40.0189 -12.0118 -0.0010 -0.0009 -0.0007 10.1329 23.1137 51.6676 109.2441
frequency: 9.8593 50.7797 109.1236 121.5156 131.8453 145.5644 198.1262 242.9442 263.3421 286.4670 375.1984 387.4460 404.8470 434.4350 458.9618 473.4468 532.9732 550.1731 554.0095 620.8487 672.5239 682.1262 728.9236 737.7115 758.3811 893.7441 908.7697 938.7704 947.9634 954.9618 1017.3695 1024.6430 1033.1459 1044.3490 1099.4645 1131.1736 1173.6929 1244.0800 1286.9625 1314.1614 1323.7768 1384.1401 1425.3205 1436.0128 1446.5636 1458.0261 1513.1419 1584.4881 1661.3521 2924.5058 2962.4717 3092.2971 3099.8969 3111.0600 3126.7689 3132.7953 3647.0536
redmass: 7.0888 6.0876 1.5487 3.1655 3.5896 3.0053 2.4506 2.8016 2.7291 2.9528 9.1791 6.1824 3.8294 3.4320 3.5567 4.7268 6.9097 6.4665 9.1068 7.2308 5.1317 6.0255 3.1499 2.4647 1.3898 6.4470 2.6283 1.3954 1.2725 3.0016 2.4234 2.4058 1.8094 5.6607 2.3244 1.5309 1.1601 1.5637 1.6020 3.3687 2.9404 1.4399 1.0632 1.4112 3.2523 1.5844 6.6001 5.6530 6.5484 1.0479 1.0951 1.0936 1.0849 1.0851 1.0938 1.0942 1.0655
irintensity: 0.3601 0.1513 3.7941 4.2997 0.6556 2.5462 78.3927 29.9573 48.1081 3.0735 43.1712 5.4948 11.8720 9.0562 17.0474 40.4192 112.5566 64.2026 17.8756 1.3854 79.3812 4.9282 101.2776 39.2447 37.8897 784.8751 153.7969 47.4074 0.5708 80.9903 169.4076 151.4540 128.5786 278.1963 302.2941 447.2059 217.6353 75.3813 60.4057 1523.3129 146.0194 25.4898 7.1949 60.8528 83.9293 53.3075 94.3816 291.7906 352.0244 448.2033 109.5188 33.7497 28.1258 20.2860 97.0988 33.9103 30.9448
temp: 298.150 k
press: 1.00000 atm
elementType: 6 6 6 6 6 6 1 1 1 1 6 6 1 1 1 8 1 6 9 9 9
symmnumber: 1
zpe: 384446.9 jmol-1
zpe.correction: 0.146428 hartree
zpe.thermalcorrener: 0.159250 hartree
zpe.thermalcorrenthalpy: 0.160194 hartree
zpe.thermalcorrgfe: 0.105420 hartree
zpe.sumelectzpe: -722.029013 hartree
zpe.sumelectthermal: -722.016191 hartree
zpe.sumelectthermalent: -722.015246 hartree
zpe.sumelectthermalfe: -722.070020 hartree
dipole: 36.5470 8.5195 -8.8647
dipole: 38.5597
quadrupole: -388.4697 -88.9440 -100.8575
quadrupole: -65.2279 58.0308 16.7452
quadrupole: -195.7126 103.8131 91.8995 -65.2279 58.0308 16.7452
hfenergy: -722.1754408 hartree
pointgroup: C01 [X(C9H8F3O1)]
dipole: 0.1685568 -0.036031 -0.1507111 debye
dipolederiv: 1.4364854 -0.5884003 0.3138007 -0.7629046 0.4504796 -0.1790171 0.321051 -0.1774972 -0.0449722 -1.0436241 0.3085025 -0.1038204 -0.6150011 -0.0659968 -0.1596157 -0.1112309 -0.0198005 -0.3760236 0.9898462 0.2417914 0.1656226 0.0408465 -0.2814517 -0.0066707 0.1184732 0.0627188 0.0188331 -0.7293482 -0.391543 -0.0515002 0.4656282 0.0729534 0.0881457 -0.1001396 -0.0964707 -0.3392638 1.0867625 0.6397865 0.2299196 0.8107741 0.6121641 0.158086 0.1730169 0.143812 -0.1103053 -2.8258732 -0.0784081 -0.4921451 -0.1095755 -1.0537632 -0.0141014 -0.2352509 0.0122272 -0.5327358 0.0415286 -0.1358038 -0.0154788 -0.1472983 -0.1443036 -0.0214794 0.0195296 -0.016618 0.1418192 -0.0403282 0.1498171 -0.0543257 0.0875068 -0.1366831 0.0394148 -0.0615666 0.1078758 0.1514289 0.0227112 -0.1106877 -0.0299539 -0.0959079 -0.1799266 -0.0187575 -0.0030949 -0.0159153 0.1605136 0.0114038 0.144851 -0.0318918 0.1664956 -0.1135729 0.0433766 -0.0166708 0.0309867 0.1389713 0.4469551 -0.3218947 0.0855051 -1.4019596 0.8213269 -0.1943951 -0.1067187 -0.0532032 -0.2911285 0.4783047 0.0680379 0.0058621 0.5318225 0.1199179 0.0627192 0.1448656 -0.0048401 0.3449413 -0.4575392 -0.1452902 0.0915779 -0.29151 -0.0158824 -0.0415112 0.2871989 0.0693659 -0.098456 0.0139637 0.124716 0.0146489 0.0036801 -0.1137595 -0.0268914 0.0060185 -0.0172897 0.0834383 -0.2869342 -0.083436 -0.1930799 -0.1529132 0.0267172 0.0069752 -0.3225781 -0.040092 -0.198032 -1.3062572 0.2272846 -0.077646 1.5496878 -1.0314952 0.2677605 -0.1990338 0.0677297 -0.3801565 0.2520672 -0.1026694 -0.0941453 -0.1857094 0.2724393 -0.035775 0.0724899 -0.0652958 0.3333803 4.7394356 0.1479488 0.68725 -0.0324349 1.814834 -0.0085946 1.6127814 0.088814 2.4176205 -1.3765202 0.3573903 0.0071727 0.8420921 -0.7474742 -0.0836448 -0.0569846 -0.1753562 -0.496607 -1.0856685 -0.4148343 -0.0208241 -0.775061 -0.9421692 0.072636 -0.1297473 0.1295044 -0.4538067 -1.3673709 -0.0371588 -0.4365482 0.0717419 -0.3643539 0.0513399 -1.4124087 -0.0306556 -1.4694591 unknown
polarizability: 297.0918551|13.9212746|153.5470032|44.5414718|2.1607765|90.8831994 unknown
InChI: InChI=1/9C.3F.O.8H
charge -1 multiplicity 1
21 atoms
C  -7.88347303 -3.02719386 1.81423141
C  -6.53796919 -2.95745451 2.11950866
C  -5.81155919 -1.67940115 2.21566116
C  -6.66322903 -0.49774658 2.01998322
C  -8.00491101 -0.59169366 1.71744034
C  -8.67663035 -1.85669538 1.59773124
H  -8.36544866 -4.01192766 1.76113095
H  -6.00596046 -3.89464192 2.33302016
H  -6.21464522 0.49932015 2.10752123
H  -8.5810766 0.33208987 1.57521222
C  -4.44971668 -1.62810617 2.45731038
C  -3.5940721 -0.41344477 2.643356
H  -2.85626765 -0.28354907 1.82047458
H  -4.19217631 0.50995404 2.70668723
H  -2.99579674 -0.48674382 3.57698155
O  -3.68132193 -2.80316694 2.55497946
H  -4.15320105 -3.50502468 2.06557412
C  -10.06710767 -1.93936301 1.16398072
F  -10.86045066 -0.917389 1.64056786
F  -10.68513189 -3.11203016 1.51928125
F  -10.28357313 -1.86914068 -0.22619462
