program: Gaussian 09
title: opt freq
version: AM64L-G09RevB.01
method: UTPSSTPSS
basis: SVP
operation: Freq
keyword: #P
keyword: Geom=AllCheck
keyword: Guess=TCheck
keyword: SCRF=Check
keyword: GenChk
keyword: UTPSSTPSS/SVP
keyword: Freq
multiplicity: 2
elementType: C C C C C C H H H H C C H H H O H O C H H H
converged: YES YES YES YES
title: Mulliken atomic charges:
charge: -0.051547 -0.064174 0.029869 -0.084529 -0.116134 0.197328 0.005057 0.004706 0.010344 0.013479 -0.070909 0.051175 0.048393 0.043134 0.045993 -0.219269 0.209066 -0.338770 0.144771 0.045082 0.052012 0.044923
chargesum: 0.00000
title: Mulliken charges with hydrogens summed into heavy atoms:
elementType: C C C C C C C C O O C
charge: -0.046490 -0.059468 0.029869 -0.074186 -0.102655 0.197328 -0.070909 0.188695 -0.010203 -0.338770 0.286789
charge: -0.104223 0.208951 -0.147849 0.231082 -0.105767 0.210380 0.003209 -0.009681 -0.010809 0.003249 0.582533 -0.060140 0.034150 0.000780 0.030186 0.090840 -0.002340 0.040886 -0.003728 0.004290 -0.000337 0.004342
polarizability: 2.68236273e+02 6.42433765e+00 1.52299204e+02 3.72270223e+00 1.60056890e+01 8.26249196e+01
1716.lowfreq: -6.0065 -0.0007 0.0004 0.0007 10.2083 23.4762 68.1550 86.1764 95.1479
frequency: 66.7755 84.6073 94.1597 149.1106 161.2611 234.3822 253.7304 290.0022 318.1203 329.7080 393.9328 421.7474 446.2466 458.9053 508.9587 527.0686 625.3040 665.5265 708.0708 787.6160 793.1782 814.4304 928.8666 952.8742 959.2806 980.7477 1001.4142 1027.9281 1046.7698 1101.6842 1154.8623 1166.2424 1189.1840 1203.4502 1254.3757 1265.4681 1304.2295 1347.2762 1382.9623 1421.5666 1431.5819 1439.1658 1452.7284 1460.8911 1465.5755 1482.6638 1531.1573 1540.3374 1607.8355 2958.7875 2978.7713 3006.9333 3055.9511 3119.9951 3120.7971 3147.6900 3152.9066 3171.9164 3173.6366 3657.9140
redmass: 1.5003 1.8787 3.9293 3.5477 3.7548 1.3296 3.6489 2.5072 3.9529 1.1739 3.6339 2.9869 3.3718 4.9051 2.3902 3.7207 6.9217 4.5960 4.3112 1.3682 5.4637 1.6079 1.3140 2.3659 1.3054 2.7027 1.3936 3.0714 2.5672 1.2793 1.1927 1.2714 1.3980 1.4677 3.1478 3.1391 1.6904 4.7009 1.4664 1.3922 1.0685 2.4319 1.4182 1.0540 1.0795 1.5415 3.7597 4.8328 5.6090 1.0424 1.0334 1.1009 1.1077 1.1026 1.0956 1.0892 1.0872 1.0938 1.0937 1.0664
irintensity: 0.9782 5.1080 0.0950 2.7260 3.4766 1.4836 5.8177 2.1619 4.9578 131.7411 13.1612 5.9507 1.6159 0.9998 10.0185 17.3892 1.6640 71.9252 0.5239 23.3035 18.2592 65.6988 1.4968 78.8155 0.1853 0.0187 2.6191 199.0733 1.3005 38.7238 101.4913 1.8772 5.1839 56.0142 483.9675 263.9970 18.3536 221.4011 77.6645 78.0897 14.6643 6.3147 137.3186 15.4332 76.0959 35.6838 7.4336 15.0269 80.3621 135.1508 111.6938 33.5371 58.3964 28.7815 12.4222 22.3092 14.0216 25.4177 1.6002 324.8890
temp: 298.150 k
press: 1.00000 atm
elementType: 6 6 6 6 6 6 1 1 1 1 6 6 1 1 1 8 1 8 6 1 1 1
symmnumber: 1
zpe: 465223.3 jmol-1
zpe.correction: 0.177194 hartree
zpe.thermalcorrener: 0.188464 hartree
zpe.thermalcorrenthalpy: 0.189408 hartree
zpe.thermalcorrgfe: 0.139681 hartree
zpe.sumelectzpe: -499.543460 hartree
zpe.sumelectthermal: -499.532191 hartree
zpe.sumelectthermalent: -499.531247 hartree
zpe.sumelectthermalfe: -499.580974 hartree
dipole: 1.8671 3.0081 0.6962
dipole: 3.6083
quadrupole: -64.1712 -73.6075 -65.3945
quadrupole: -26.5455 -0.8566 6.6553
quadrupole: 3.5532 -5.8831 2.3299 -26.5455 -0.8566 6.6553
hfenergy: -499.7206546 hartree
pointgroup: C01 [X(C9H11O2)]
dipole: 0.7345722 1.1834802 0.273914 debye
dipolederiv: -0.1545257 -0.2859448 -0.061636 0.2288579 0.1655953 0.0812148 0.0533344 0.0735523 -0.1724272 -0.0069031 0.2566395 0.0583902 -0.2542569 0.0432573 0.0472938 -0.0524902 0.0540259 -0.1753056 0.2893671 0.1953011 0.047533 -0.0126143 -0.3649056 -0.0752002 0.0127629 -0.0690869 -0.0362892 0.0677856 -0.3484334 -0.0723874 0.2873204 0.1111889 0.0703523 0.0651286 0.0636684 -0.1847177 -0.1942964 0.3481741 0.0764417 -0.3489139 0.1147694 0.0671817 -0.0754211 0.0756417 -0.2009589 2.0921558 0.0440651 0.0322408 0.5060098 -0.1729896 -0.0526389 0.1367009 -0.057517 0.0804648 0.0460966 -0.1189214 -0.0279024 -0.098115 -0.0615817 -0.049146 -0.022629 -0.0486687 0.1449844 0.0402614 0.1259454 0.0265826 0.0680055 -0.0148121 -0.0343861 0.0119259 -0.0333436 0.1403936 0.0601234 -0.0875758 -0.0209412 -0.0810646 -0.0877597 -0.0538632 -0.0179348 -0.0529203 0.1419295 0.0183117 0.1032656 0.0200745 0.1281965 0.0033982 -0.0378716 0.0253835 -0.0371555 0.1744496 1.1842738 -0.2302008 -0.031568 -1.1753006 0.8545618 0.1868514 -0.3092637 0.1864037 -0.0329212 0.0504217 -0.05134 -0.0167795 0.2704318 -0.0178781 -0.0486913 0.0925245 -0.0390262 0.1730934 -0.1471403 -0.0983036 0.0933411 -0.1995345 0.0056894 0.0054353 0.1587961 0.0538942 -0.0658438 0.0321455 0.1208981 0.034513 0.0200677 -0.0373856 -0.0354955 0.0073855 -0.0408734 0.096002 -0.1506139 -0.0378406 -0.1313218 -0.0778198 0.0179798 0.0385452 -0.2219621 -0.0068455 -0.0573937 -1.6965797 0.3122564 0.049266 1.295567 -0.8910017 -0.0984777 0.2912608 -0.1127597 -0.3786691 0.5384465 -0.0965012 -0.0190352 -0.0586056 0.3540216 -0.0058575 -0.0164584 -0.0057683 0.3730486 -2.9971218 0.1738858 0.0089503 0.0440656 -0.5861234 -0.0599688 -0.0253197 -0.0618092 -0.3272945 1.177452 -0.2537662 -0.0489503 -0.910917 0.6344353 0.0339808 -0.1988375 0.0409862 0.4518771 -0.0343013 -0.0345032 0.0563306 0.2206723 -0.0842936 0.0929041 0.0080593 0.1259727 -0.0714112 -0.1796538 -0.0328025 -0.0095159 -0.0566846 0.0112216 -0.0171588 -0.0130983 -0.0166435 0.0842581 -0.0357052 -0.0042975 -0.0636261 0.2046321 0.0026124 -0.0550038 0.0901524 -0.0917273 -0.1572689 unknown
polarizability: 268.2362729|6.4243377|152.2992038|3.7227022|16.005689|82.6249196 unknown
InChI: InChI=1/9C.2O.11H
charge 0 multiplicity 2
22 atoms
C  -7.82995086 -3.29610698 1.86369971
C  -6.45190234 -3.13070412 1.91946928
C  -5.85644322 -1.85260891 2.20893906
C  -6.76374574 -0.7660904 2.43265784
C  -8.14981317 -0.93535101 2.37675945
C  -8.70360344 -2.20444994 2.09211023
H  -8.26646129 -4.27652467 1.64203033
H  -5.79857809 -3.9893407 1.7393137
H  -6.37367616 0.23248505 2.6551516
H  -8.79693244 -0.07189927 2.55673753
C  -4.44130196 -1.70784451 2.26375955
C  -3.66754111 -0.45838628 2.53738321
H  -3.03989443 -0.17803708 1.66565471
H  -4.32064001 0.39550502 2.77054851
H  -2.97741214 -0.60230267 3.39417385
O  -3.70954541 -2.84534303 2.02117186
H  -2.75829509 -2.62753735 2.08729188
O  -10.04158393 -2.47463434 2.01663511
C  -10.96533523 -1.41081382 2.24854346
H  -10.84579364 -0.5981865 1.50672584
H  -11.96827047 -1.85203948 2.14243932
H  -10.85694673 -0.99366135 3.26799002
