program: Gaussian 09
title: opt freq
version: AM64L-G09RevB.01
method: UTPSSTPSS
basis: SVP
operation: Freq
keyword: #P
keyword: Geom=AllCheck
keyword: Guess=TCheck
keyword: SCRF=Check
keyword: GenChk
keyword: UTPSSTPSS/SVPFreq
multiplicity: 2
elementType: C C C C C C H H H H C H O O C H H H H
converged: YES YES NO YES
title: Mulliken atomic charges:
charge: 0.025299 -0.051192 -0.051604 0.192684 -0.109969 -0.091470 0.015252 0.009183 0.017573 0.012492 0.043339 0.040107 -0.216580 -0.336283 0.144073 0.053291 0.046741 0.046529 0.210534
chargesum: 0.00000
title: Mulliken charges with hydrogens summed into heavy atoms:
elementType: C C C C C C C O O C
charge: 0.025299 -0.035940 -0.042421 0.192684 -0.092397 -0.078978 0.083447 -0.006046 -0.336283 0.290634
charge: -0.146048 0.183244 -0.104721 0.215447 -0.106603 0.266030 -0.008503 0.003308 0.003131 -0.012085 0.584493 -0.029533 0.107233 0.042740 -0.003918 -0.000359 0.004493 0.004525 -0.002874
polarizability: 1.57929067e+02 3.04167143e+01 2.03167091e+02 -1.64677443e+01 -3.95057039e+01 7.65033979e+01
1716.lowfreq: -0.0009 -0.0005 0.0006 8.2825 11.0964 26.2246 84.3013 111.7229 163.0616
frequency: 83.8937 111.6736 163.0339 182.3748 247.8142 269.4511 307.8863 357.1692 374.5708 419.5093 499.3931 501.7369 550.7455 623.1090 637.0505 702.8576 741.4523 777.0196 814.2235 826.0794 919.6481 960.6670 979.8011 1032.5206 1107.7404 1129.6259 1151.2172 1163.4470 1190.1654 1216.9080 1265.2458 1305.1228 1329.9696 1350.9003 1428.7355 1448.4815 1457.0847 1465.6778 1480.5791 1530.9593 1542.3815 1607.2099 2980.2000 3058.5809 3121.4855 3127.1095 3141.9942 3161.0547 3175.8878 3181.2966 3634.6075
redmass: 3.6697 3.5866 4.5342 1.9427 1.1577 3.3517 2.0830 6.4046 3.0157 3.1860 3.7368 2.3008 4.6546 7.0614 1.2121 4.3775 4.4388 1.4092 1.5125 5.1270 1.3039 1.2986 2.7551 6.4341 1.2784 3.1808 1.2788 1.1795 1.3847 1.4091 3.9607 1.4204 1.5711 5.0588 3.0616 1.2954 1.0457 1.0699 1.9680 3.2936 5.2403 5.5511 1.0332 1.1077 1.1028 1.0885 1.0875 1.0958 1.0926 1.0906 1.0655
irintensity: 2.6233 0.0131 0.8909 25.3821 5.2829 12.2062 14.5637 3.6742 27.9134 0.1469 5.4961 57.1360 14.6386 2.8996 69.7019 0.0304 95.2445 35.8230 64.7876 7.3725 2.9425 0.0050 1.4676 180.5472 8.0250 377.6127 1.8791 122.3252 6.0086 36.3108 456.4044 31.8196 4.8819 122.4860 53.9690 145.8001 12.9114 27.9501 208.9098 35.5480 34.6011 93.2991 107.3996 55.3976 31.0569 29.6035 14.5520 17.2485 9.8562 10.3407 102.5222
temp: 298.150 k
press: 1.00000 atm
elementType: 6 6 6 6 6 6 1 1 1 1 6 1 8 8 6 1 1 1 1
symmnumber: 1
zpe: 393794.8 jmol-1
zpe.correction: 0.149989 hartree
zpe.thermalcorrener: 0.159581 hartree
zpe.thermalcorrenthalpy: 0.160525 hartree
zpe.thermalcorrgfe: 0.114847 hartree
zpe.sumelectzpe: -460.270301 hartree
zpe.sumelectthermal: -460.260708 hartree
zpe.sumelectthermalent: -460.259764 hartree
zpe.sumelectthermalfe: -460.305443 hartree
dipole: -1.4163 2.4778 -0.5159
dipole: 2.9002
quadrupole: -47.9953 -58.4623 -62.0717
quadrupole: -8.7283 1.4714 -1.1780
quadrupole: 8.1812 -2.2859 -5.8953 -8.7283 1.4714 -1.1780
hfenergy: -460.4202895 hartree
pointgroup: C01 [X(C8H9O2)]
dipole: -0.5572109 0.9748287 -0.2029559 debye
dipolederiv: -0.2870766 0.2255335 -0.033524 0.1895565 0.0333369 -0.0242582 -0.024452 -0.0275705 0.0191636 0.181116 -0.1944512 0.0199246 0.2194335 0.0925876 -0.0904992 -0.0886598 -0.0525793 -0.1511233 0.0905905 0.0921908 -0.0507277 -0.3551469 -0.108381 0.008532 0.0647746 -0.032652 -0.1941098 0.4293026 1.2601257 -0.3637691 0.6946294 1.3623699 -0.3980514 -0.2141192 -0.4495094 0.2388106 0.0260859 -0.5444112 0.1247321 0.2421757 -0.1864802 -0.0263197 -0.0832506 0.0443932 -0.2057875 0.0749814 0.2958018 -0.1046607 -0.3729205 0.0530418 -0.0389894 0.073604 -0.0989375 -0.2033075 0.0374532 0.0835871 -0.0117607 0.1060737 -0.0693586 0.0495395 -0.0170831 0.0510941 0.1405123 -0.1141781 -0.0120944 0.0282079 -0.0307144 0.1183837 0.013622 0.0334663 0.0123722 0.152829 0.0872853 0.0973068 -0.0173534 0.0735295 -0.0425792 0.0531038 -0.0112749 0.0509145 0.1698597 -0.1773103 -0.0161922 0.0350021 -0.05188 0.0810737 0.0254715 0.043861 0.0228305 0.1502606 1.5553192 0.8645335 -0.388062 0.0004135 0.3004166 -0.1322813 -0.1548709 -0.2049988 -0.1325874 0.0197932 0.0392227 0.0052403 0.02737 -0.0528511 0.0618321 0.0083135 0.0591896 0.1745784 -1.8756858 -1.2738233 0.4775167 0.0216736 -0.4426445 0.0286972 0.1295641 0.1408323 -0.377996 -0.8764201 -0.7609279 0.2520301 -0.6520749 -2.4292089 0.6193282 0.224992 0.6318754 -0.4992179 0.3000219 -0.5230571 0.1498121 0.1026218 1.4232909 -0.26935 -0.0147403 -0.2116428 0.4972619 -0.0497002 -0.1028352 0.0396861 -0.077938 -0.096714 0.0561323 0.0335802 0.058706 0.0710172 0.0180699 0.1532914 -0.1542247 -0.0735303 -0.0905584 -0.0223262 -0.0877145 0.0596756 -0.1061575 0.0513188 0.1912167 0.0373547 -0.0237309 -0.1162381 0.0270692 0.0863384 -0.0983563 -0.1130534 0.5090331 0.1249826 -0.0454243 -0.0395412 0.1705129 0.0587475 -0.002329 0.0443631 0.3690468 unknown
polarizability: 157.9290674|30.4167143|203.1670913|-16.4677443|-39.5057039|76.5033979 unknown
InChI: InChI=1/8C.2O.9H
charge 0 multiplicity 2
19 atoms
C  -2.90488 -2.867094 0.662466
C  -1.472651 -2.856438 0.530964
C  -0.786401 -1.708974 0.164437
C  -1.482654 -0.498462 -0.094533
C  -2.889297 -0.476652 0.026135
C  -3.583698 -1.633733 0.394814
H  -0.915417 -3.780095 0.726659
H  0.304776 -1.714605 0.067847
H  -3.452133 0.441079 -0.167096
H  -4.67648 -1.5713 0.473645
C  -3.565953 -4.060574 1.038291
H  -3.022214 -4.990604 1.233195
O  -4.909011 -4.202738 1.19614
O  -0.713776 0.572976 -0.448517
C  -1.364514 1.816696 -0.715351
H  -0.565094 2.527014 -0.97527
H  -2.068737 1.731404 -1.564612
H  -1.908117 2.187347 0.174332
H  -5.358509 -3.350625 1.017332
