program: Gaussian 09
title: opt freq
version: AM64L-G09RevB.01
method: UTPSSTPSS
basis: SVP
operation: Freq
keyword: #P
keyword: Geom=AllCheck
keyword: Guess=TCheck
keyword: SCRF=Check
keyword: GenChk
keyword: UTPSSTPSS/SVP
keyword: Freq
multiplicity: 2
elementType: C C C C C C H H H H C H H O H O C H H H
converged: YES YES NO YES
title: Mulliken atomic charges:
charge: -0.074324 0.021867 0.044633 0.225777 -0.020569 0.035432 0.048403 0.061220 0.064704 0.059131 0.253705 0.089303 0.089561 -0.288076 0.219855 -0.242051 0.133172 0.087930 0.094862 0.095466
chargesum: 1.00000
title: Mulliken charges with hydrogens summed into heavy atoms:
elementType: C C C C C C C O O C
charge: -0.074324 0.070270 0.105853 0.225777 0.044134 0.094562 0.432569 -0.068222 -0.242051 0.411430
charge: 0.330417 -0.065800 0.166420 0.167967 0.055632 0.015179 0.000563 -0.008508 -0.003871 -0.002163 -0.027984 0.052953 0.052366 0.056891 -0.001535 0.194419 -0.012038 -0.000250 0.014813 0.014530
polarizability: 1.78227030e+02 9.90006284e+01 2.76903961e+02 -6.86775334e+00 -6.09672902e+01 8.96402472e+01
1716.lowfreq: -24.1954 -16.3478 -0.0007 0.0004 0.0006 14.0297 72.8139 97.4208 166.0180
frequency: 71.3074 96.0783 165.8828 171.3118 192.5649 233.9548 242.5323 302.6713 377.3741 387.6266 455.8016 485.9994 558.8995 599.6671 667.0320 713.1791 792.3612 810.8775 822.6244 920.5634 971.3055 980.7218 993.9938 1001.3688 1066.9609 1112.8233 1133.2837 1154.6046 1176.3893 1179.3451 1213.2231 1223.9036 1292.5396 1329.4385 1345.3083 1375.6676 1419.6212 1434.1116 1450.5306 1460.0630 1468.3012 1492.5909 1503.8843 1634.2751 2898.1444 2913.3408 3033.3260 3141.1749 3176.6268 3177.7398 3189.7895 3201.9987 3206.6596 3662.8271
redmass: 5.0212 2.1685 2.8046 4.0644 1.1019 1.4248 2.7918 2.8948 5.1011 2.9396 4.9918 2.4505 5.0885 6.3778 2.1655 4.0258 1.2698 5.5093 1.9899 1.9674 7.1111 2.7954 1.3546 1.3430 6.2729 1.2733 1.2739 1.2383 1.1224 1.2997 1.1148 1.9173 1.5136 1.9583 1.6324 2.7826 1.4142 1.2250 1.1128 1.1772 4.2590 4.7446 2.4671 5.9607 1.0605 1.0930 1.0289 1.1100 1.1070 1.0939 1.0899 1.0975 1.0955 1.0672
irintensity: 3.5183 62.4113 2.7979 5.0907 5.6395 107.8244 16.9054 0.5959 0.8380 4.1259 14.0926 9.9403 11.9335 21.0503 3.9639 59.7927 2.0361 38.1785 53.1317 29.8898 111.8545 46.0904 0.3137 0.4297 442.4291 36.4830 0.8697 113.4208 17.5871 22.6195 2.9592 17.6191 118.6474 776.8948 102.5764 4.6383 103.2734 31.0053 20.0795 19.2155 11.4823 17.8775 473.0961 22.3068 222.6902 20.6926 14.0061 2.9729 15.2112 1.0823 0.2413 4.6919 3.2624 644.0757
temp: 298.150 k
press: 1.00000 atm
elementType: 6 6 6 6 6 6 1 1 1 1 6 1 1 8 1 8 6 1 1 1
symmnumber: 1
zpe: 425177.9 jmol-1
zpe.correction: 0.161942 hartree
zpe.thermalcorrener: 0.171929 hartree
zpe.thermalcorrenthalpy: 0.172874 hartree
zpe.thermalcorrgfe: 0.126142 hartree
zpe.sumelectzpe: -460.692416 hartree
zpe.sumelectthermal: -460.682428 hartree
zpe.sumelectthermalent: -460.681484 hartree
zpe.sumelectthermalfe: -460.728215 hartree
dipole: -14.7997 -5.9499 -0.4402
dipole: 15.9570
quadrupole: 5.1445 -14.6876 -53.7971
quadrupole: 35.8795 -0.8857 -9.4936
quadrupole: 26.2579 6.4258 -32.6838 35.8795 -0.8857 -9.4936
hfenergy: -460.8543578 hartree
pointgroup: C01 [X(C8H10O2)]
dipole: -1.1756504 0.6323809 -0.6562444 debye
dipolederiv: 0.8090454 0.5946403 -0.0199953 0.4429759 0.5570349 -0.0706972 0.0529052 -0.0153022 0.0853565 -0.4693872 -0.1163367 -0.0729863 -0.2025989 -0.0200822 -0.0929524 -0.0378888 -0.0681332 -0.0616139 0.310942 0.321644 -0.0167881 -0.0292841 -0.340438 0.1077748 0.1339131 0.2225049 -0.1242038 1.1896609 1.3467106 -0.2998497 0.6874467 1.4005219 -0.2637295 -0.0010686 -0.0443234 0.2986881 -0.6804351 -0.7909891 0.1745876 -0.0302812 -0.1634463 -0.0023056 -0.1604239 -0.2452723 -0.0860398 0.2954882 0.2647712 0.0019737 0.1572013 0.1883973 -0.0633929 0.0503451 -0.0274278 -0.0450937 0.121082 -0.0283391 0.0026903 0.0481456 0.074102 0.0484945 -0.0305683 0.0246673 0.1298335 0.0511857 -0.007009 -0.0298522 -0.032725 0.1263509 0.0012472 -0.0206162 0.00816 0.1425985 0.1336566 -0.0042814 -0.0148719 0.0065423 0.0725958 0.0513445 -0.0183574 0.0499271 0.1553658 0.0240378 0.0106781 -0.0466127 0.0069334 0.1423554 0.0070803 -0.045059 0.0096362 0.1345013 -0.9950581 -2.0819584 0.5006537 -0.4290217 0.3941492 -0.1887399 -0.2349987 -0.7397059 0.5389728 0.2880753 0.2659924 -0.1087861 0.0337363 0.1603878 -0.0484962 -0.0070489 0.0942944 -0.0411156 0.2072633 0.3471635 -0.0160702 0.0870378 0.1172148 -0.0099687 0.1051124 0.0179778 0.0760904 -0.0706472 0.7731918 -0.2021191 -0.2181258 -1.5612342 0.3929942 0.2336905 0.716071 -0.7475762 0.3787953 0.1994431 -0.0953515 0.1539732 0.7259289 -0.0906694 -0.0767897 -0.0786107 0.4163208 -1.0977136 -1.2772021 0.292359 -0.8306649 -1.9859815 0.4856288 0.0892184 0.3297752 -0.3823059 0.3506843 0.1963778 -0.0636003 0.4040739 1.3994293 -0.3648353 -0.1521144 -0.4303547 0.415999 0.0001488 -0.0660743 -0.0102451 -0.0565427 -0.0374412 0.0510918 -0.0138375 0.048178 0.0928423 0.1148505 0.0048479 -0.0336991 -0.1130106 -0.1447928 -0.0214549 0.0078675 0.0579822 -0.0161876 0.0383252 0.0467295 0.0585633 -0.0858116 -0.1050518 0.0715859 0.125719 0.069956 0.0175672 unknown
polarizability: 178.2270304|99.0006284|276.9039609|-6.8677533|-60.9672902|89.6402472 unknown
InChI: InChI=1/8C.2O.10H
charge 1 multiplicity 2
20 atoms
C  -3.281918 -2.671898 0.470502
C  -1.933072 -2.700308 0.919663
C  -1.110702 -1.611857 0.710069
C  -1.62257 -0.450319 0.035573
C  -2.976737 -0.409807 -0.42063
C  -3.78186 -1.509041 -0.199923
H  -1.560103 -3.591066 1.430844
H  -0.068771 -1.599673 1.042628
H  -3.368764 0.471826 -0.93234
H  -4.822076 -1.497934 -0.54125
C  -4.197996 -3.826238 0.681144
H  -4.594655 -4.133626 -0.317516
H  -5.098146 -3.451691 1.226605
O  -3.570305 -4.88406 1.351885
H  -4.226855 -5.599456 1.464997
O  -0.753171 0.534784 -0.113875
C  -1.112684 1.772496 -0.78599
H  -0.203882 2.386712 -0.752329
H  -1.400108 1.556442 -1.827464
H  -1.936366 2.264088 -0.244112
