program: Gaussian 09
title: opt freq
version: AM64L-G09RevB.01
method: RTPSSTPSS
basis: SVP
operation: Freq
keyword: #P
keyword: Geom=AllCheck
keyword: Guess=TCheck
keyword: SCRF=Check
keyword: GenChk
keyword: RTPSSTPSS/SVP
keyword: Freq
multiplicity: 1
elementType: C C C C C C H H H H C H O O C H H H H
converged: YES YES YES YES
title: Mulliken atomic charges:
charge: 0.068532 -0.150746 -0.064788 0.057092 -0.053941 -0.175356 -0.032587 -0.024367 -0.028905 -0.047526 -0.169201 -0.049197 -0.336917 -0.393888 0.184592 0.027481 0.007609 0.003605 0.178508
chargesum: -1.00000
title: Mulliken charges with hydrogens summed into heavy atoms:
elementType: C C C C C C C O O C
charge: 0.068532 -0.183333 -0.089156 0.057092 -0.082846 -0.222882 -0.218398 -0.158409 -0.393888 0.223287
polarizability: 1.67362087e+02 3.69662251e+01 2.27199733e+02 -2.84799809e+01 -1.54824117e+01 8.45975729e+01
1716.lowfreq: -14.6881 0.0007 0.0009 0.0010 18.8336 22.8953 66.0120 82.9099 143.9844
frequency: 65.6527 82.2077 143.5814 180.3083 190.0471 218.1550 260.7649 343.6455 386.1692 389.7008 425.8123 436.9534 490.7623 558.9692 625.4325 681.4563 722.2654 768.1305 773.1569 807.4105 922.7284 934.6160 961.7746 1004.6720 1020.2506 1077.1053 1134.1268 1152.6219 1177.3294 1202.6773 1208.2635 1232.6283 1269.8408 1317.8816 1411.5528 1446.8096 1449.1636 1457.1089 1473.4384 1487.8859 1520.6187 1625.5261 2939.8368 3000.6134 3056.9101 3071.6342 3088.7102 3103.0237 3113.5894 3129.4943 3535.3368
redmass: 3.1683 3.9972 3.1138 3.8593 4.1056 1.1744 1.2590 5.0026 1.3006 4.7560 4.3168 2.7646 2.3443 5.0178 7.2348 3.6040 4.9922 1.9467 1.2666 4.9011 1.2533 1.2748 2.8156 6.1168 6.2153 1.3147 1.1874 1.2755 2.4561 1.5716 1.3345 1.2959 1.4133 3.1177 2.1539 1.6133 1.5418 1.3967 1.0557 5.0375 3.9251 6.5724 1.0336 1.1055 1.0880 1.1005 1.0849 1.0866 1.0943 1.0921 1.0680
irintensity: 8.9647 8.6230 79.6604 0.8486 59.1340 0.3551 77.9884 8.3017 135.2084 4.2549 17.6867 11.7246 44.7001 34.0731 3.2285 4.7153 123.2305 66.6530 5.0089 18.5313 2.2006 0.5410 13.5916 367.9989 71.5665 13.5893 4.6474 8.2772 164.5305 74.4225 21.9782 0.3878 5.3575 61.6645 92.1805 76.8620 35.2048 18.2808 29.3179 9.8937 152.8877 371.1358 144.1311 107.8044 121.1567 102.5069 62.6043 48.8616 97.4806 44.6743 57.7662
temp: 298.150 k
press: 1.00000 atm
elementType: 6 6 6 6 6 6 1 1 1 1 6 1 8 8 6 1 1 1 1
symmnumber: 1
zpe: 383273.6 jmol-1
zpe.correction: 0.145981 hartree
zpe.thermalcorrener: 0.156232 hartree
zpe.thermalcorrenthalpy: 0.157177 hartree
zpe.thermalcorrgfe: 0.110497 hartree
zpe.sumelectzpe: -460.346288 hartree
zpe.sumelectthermal: -460.336036 hartree
zpe.sumelectthermalent: -460.335092 hartree
zpe.sumelectthermalfe: -460.381772 hartree
dipole: 14.2872 11.2724 -2.1575
dipole: 18.3261
quadrupole: -111.7751 -101.1528 -62.5352
quadrupole: -42.4634 0.5616 -1.2921
quadrupole: -19.9541 -9.3317 29.2859 -42.4634 0.5616 -1.2921
hfenergy: -460.4922688 hartree
pointgroup: C01 [X(C8H9O2)]
dipole: 0.9034084 1.7367843 -0.2302643 debye
dipolederiv: 0.0822752 0.9401633 0.0472049 0.9370277 1.5652957 -0.1591612 0.0567593 -0.0087423 0.0517346 -0.2643246 -1.0381259 -0.0263372 0.1789844 -0.4659364 -0.0125296 0.0026134 0.2461021 -0.3568084 0.1130903 0.0210204 -0.009527 -0.4286413 1.0792877 0.1265514 -0.0764027 0.0245562 -0.1354477 -0.4289612 0.5876251 -0.0066774 0.5504958 0.4263153 -0.3115171 0.0946598 -0.0631873 -0.272735 0.9474853 0.2028109 -0.3053193 0.6951498 0.3173485 -0.1264297 -0.2142631 -0.0054705 -0.0669344 -0.0689559 0.3873431 -0.0297469 -0.9530195 -0.9134248 0.2577408 -0.0336417 -0.1135468 -0.3983512 -0.051513 0.136659 0.048721 0.1650483 -0.1724293 -0.0341271 0.0439516 -0.0316309 0.1446456 -0.2363299 -0.0633075 0.0847648 -0.0496222 0.1060562 0.0021217 0.0650732 0.0025514 0.1343521 0.040763 0.1490215 0.0198159 0.1480655 -0.1859145 -0.0493968 0.0323423 -0.0574452 0.1372239 -0.2121363 0.0212505 0.0964701 -0.0417383 0.0698154 0.0117952 0.0658406 -0.0169148 0.1424815 0.6801291 -0.3184354 -0.3829956 -0.7582091 -0.8940373 0.1253121 -0.7949154 -0.668264 -0.449325 -0.0702846 0.240091 0.0881089 0.0842265 -0.31112 -0.0005047 0.1917255 0.2340403 0.1732822 -1.1901597 -0.6400505 0.2312431 -0.016629 -0.6225664 0.0701618 0.2589978 0.320991 -0.1418228 -0.8086345 -0.5819303 0.2259262 -0.5489496 -1.6602709 0.4487855 0.1700947 0.3606582 -0.7611105 0.5675669 0.0100889 -0.0534317 0.0385646 0.6735474 -0.2080245 -0.2541618 -0.6082566 0.9919917 -0.0136528 -0.1655256 0.015098 -0.1661406 -0.2703216 0.0447081 0.0152175 0.0397649 0.0011803 -0.073347 0.0651375 0.1035196 0.1236046 -0.0633019 -0.1187844 0.1407587 0.077383 -0.1411679 -0.1890058 0.1182626 -0.1501667 -0.0012422 0.0111811 0.0193262 -0.0031617 0.1678449 -0.1009733 0.1759953 -0.0720987 0.0033295 0.0430249 0.3104759 -0.0860276 0.2385119 0.0995663 0.0477841 unknown
polarizability: 167.3620873|36.9662251|227.1997326|-28.4799809|-15.4824117|84.5975729 unknown
InChI: InChI=1/8C.2O.9H
charge -1 multiplicity 1
19 atoms
C  -3.019518 -2.830706 0.541656
C  -1.601864 -2.668303 0.233255
C  -0.998064 -1.41657 0.133276
C  -1.7330 -0.220526 0.332803
C  -3.106645 -0.332067 0.641733
C  -3.733999 -1.575444 0.753825
H  -0.98929 -3.568943 0.083279
H  0.075794 -1.34651 -0.089366
H  -3.683391 0.588419 0.809545
H  -4.802529 -1.626785 0.996829
C  -3.642904 -4.07495 0.630226
H  -3.08169 -5.022578 0.579434
O  -5.009016 -4.194675 0.988144
O  -1.10601 1.03331 0.287019
C  -0.98406 1.585875 -1.021102
H  -0.490293 2.568649 -0.918235
H  -0.366665 0.946884 -1.68699
H  -1.974175 1.73083 -1.502561
H  -5.087443 -4.011287 1.948109
