program: Gaussian 09
title: opt freq
version: AM64L-G09RevB.01
method: RTPSSTPSS
basis: SVP
operation: Freq
keyword: #P
keyword: Geom=AllCheck
keyword: Guess=TCheck
keyword: SCRF=Check
keyword: GenChk
keyword: RTPSSTPSS/SVP
keyword: Freq
multiplicity: 1
elementType: C C C C C C H H H H C H H O H O C H H H
converged: YES YES YES YES
title: Mulliken atomic charges:
charge: -0.109222 -0.035692 -0.059657 0.215185 -0.117335 -0.045132 0.002970 0.008400 0.018036 0.011246 0.263115 0.032686 0.011887 -0.344051 0.193914 -0.338071 0.143543 0.053478 0.047329 0.047371
chargesum: 0.00000
title: Mulliken charges with hydrogens summed into heavy atoms:
elementType: C C C C C C C O O C
charge: -0.109222 -0.032722 -0.051257 0.215185 -0.099299 -0.033886 0.307687 -0.150136 -0.338071 0.291721
polarizability: 1.45720793e+02 2.13749940e+01 1.64230387e+02 1.05063808e+01 -2.97118610e+01 8.50382816e+01
1716.lowfreq: -0.0005 0.0006 0.0009 2.3446 5.7716 27.5258 49.8200 89.3344 134.8158
frequency: 49.4539 89.1459 134.7946 183.0169 232.8152 247.6161 256.4397 333.2333 387.0128 421.9047 450.9486 513.1194 564.0010 631.1008 702.9337 731.3368 817.0114 826.2386 836.8253 945.1690 978.7252 997.9611 1008.1347 1036.6614 1045.5283 1099.7888 1152.8263 1155.5253 1173.0771 1190.0163 1222.0203 1239.4244 1264.7469 1299.9578 1363.8146 1420.6727 1434.5388 1454.4663 1455.9915 1468.1987 1475.2662 1525.2288 1597.7468 1638.5091 2933.9946 2965.7005 2982.3559 3061.6070 3121.7298 3135.1988 3152.7096 3166.9934 3177.0122 3679.1413
redmass: 3.8877 2.9783 4.2175 2.9398 1.6596 1.6292 1.2494 3.1226 4.7585 3.0543 4.6900 2.7647 3.8326 6.9102 3.3417 3.9916 1.6625 2.5475 1.6529 1.3002 1.3298 2.4007 1.8314 6.5763 6.3531 1.2482 1.2740 1.1938 1.2766 1.3878 1.6764 1.1596 4.2885 1.3133 6.2309 2.1851 1.9944 1.2022 1.0644 1.0609 1.0801 2.6320 6.8098 6.2586 1.0583 1.1053 1.0330 1.1079 1.1031 1.0901 1.0877 1.0958 1.0930 1.0665
irintensity: 3.2088 12.4367 1.0225 11.4703 38.6019 54.4617 66.3539 1.7998 4.0632 0.7277 1.6383 16.3204 22.4810 3.6052 5.9783 10.3492 40.2110 6.8750 63.9838 2.6663 0.4234 1.4925 7.0823 129.0728 112.8583 21.0981 5.2629 92.5607 58.3652 5.2814 23.5400 12.9582 426.6764 25.6658 32.1200 64.7586 19.9357 31.9701 10.1317 26.6066 6.8493 157.1738 25.2494 89.1668 101.7652 97.4037 84.2486 53.3700 27.5703 23.7728 7.2638 17.5097 8.7759 72.4964
temp: 298.150 k
press: 1.00000 atm
elementType: 6 6 6 6 6 6 1 1 1 1 6 1 1 8 1 8 6 1 1 1
symmnumber: 1
zpe: 427242.6 jmol-1
zpe.correction: 0.162728 hartree
zpe.thermalcorrener: 0.172539 hartree
zpe.thermalcorrenthalpy: 0.173483 hartree
zpe.thermalcorrgfe: 0.127396 hartree
zpe.sumelectzpe: -460.889705 hartree
zpe.sumelectthermal: -460.879894 hartree
zpe.sumelectthermalent: -460.878950 hartree
zpe.sumelectthermalfe: -460.925036 hartree
dipole: -2.0406 0.5573 -1.9673
dipole: 2.8888
quadrupole: -44.1544 -41.6455 -63.4204
quadrupole: 7.9922 5.3009 -0.5278
quadrupole: 5.5857 8.0946 -13.6803 7.9922 5.3009 -0.5278
hfenergy: -461.0524327 hartree
pointgroup: C01 [X(C8H10O2)]
dipole: -0.8028399 0.2192718 -0.773989 debye
dipolederiv: -0.2382573 0.0651121 -0.0155881 0.223178 -0.0626742 0.0833109 -0.0128957 0.1347564 -0.2013985 0.2140508 -0.0229065 0.0779042 0.0930276 0.0377294 -0.0463549 0.0011725 -0.1544545 -0.0787796 0.0047201 0.0669825 0.0311457 -0.283013 -0.3778086 -0.0119837 0.1723514 0.0792996 -0.1972363 0.7951271 1.1533612 -0.2881159 0.7264772 1.3621636 -0.2862818 -0.134206 -0.1988316 0.20143 -0.2692946 -0.4529907 0.1621063 0.0779661 -0.2008613 0.0064878 -0.0484462 -0.1116466 -0.2062997 0.117945 0.1015858 0.0097129 -0.1332233 0.2046833 -0.1784636 0.1375669 -0.0926627 -0.076723 0.1169449 0.0637056 -0.0282389 0.0900394 -0.0310101 0.078963 -0.0575183 0.0734388 0.0996302 -0.108158 -0.0088716 -0.061909 -0.0364021 0.1122494 0.0093001 -0.0513229 0.0273342 0.1370333 0.1028806 0.0477886 -0.0374404 0.0432752 -0.0372182 0.0942056 -0.0306481 0.0949036 0.1437797 -0.1335054 0.0031863 -0.0618545 0.0026365 0.1045295 0.0160776 -0.0600833 0.0123878 0.1242389 0.6100822 -0.0238886 0.0166426 -0.0920223 0.7605342 -0.2567165 -0.0468505 -0.4041 0.870745 0.006741 -0.0304695 0.0276699 -0.1232535 -0.2516504 -0.0844827 0.0224341 -0.0512858 -0.1783826 -0.2800151 0.0358395 -0.0022397 0.1021199 -0.0511407 0.0354724 0.022021 0.0383796 -0.0094016 -0.5786555 0.0855714 0.0043895 0.0732897 -0.8178639 0.345048 0.0152028 0.4066885 -0.8847375 0.3023879 -0.0924434 -0.0585579 -0.0665331 0.2942077 -0.0211678 -0.0460353 -0.0085155 0.3208232 -0.9514695 -0.8612182 0.1777859 -0.6818255 -2.0537236 0.4868684 0.1160597 0.4559795 -0.4794399 0.2963732 -0.2938249 0.0785674 0.1412784 1.2606026 -0.2752735 -0.0890029 -0.3854533 0.5579249 -0.0728559 -0.1154009 0.0080739 -0.0818111 -0.0639126 0.0390404 -0.0034744 0.0331576 0.0761275 0.070513 0.0913141 -0.1011617 -0.0632287 -0.0757615 -0.0496776 -0.0287801 0.0799192 -0.164697 -0.0055543 0.1875669 0.0611077 -0.0119753 -0.1130745 0.0156277 0.1224554 -0.0292948 -0.0546371 unknown
polarizability: 145.7207925|21.374994|164.2303874|10.5063808|-29.711861|85.0382816 unknown
InChI: InChI=1/8C.2O.10H
charge 0 multiplicity 1
20 atoms
C  -3.30897 -2.672472 0.437409
C  -1.943499 -2.738708 0.787523
C  -1.089682 -1.653314 0.575021
C  -1.581196 -0.462503 -0.004717
C  -2.943627 -0.378999 -0.357382
C  -3.788303 -1.478454 -0.12759
H  -1.55589 -3.655395 1.244241
H  -0.031276 -1.704026 0.852657
H  -3.356628 0.532246 -0.798633
H  -4.848068 -1.395365 -0.3988
C  -4.218719 -3.867653 0.626908
H  -4.167963 -4.516428 -0.274996
H  -5.270759 -3.519929 0.70711
O  -3.817643 -4.596504 1.787019
H  -4.26549 -5.462918 1.7472
O  -0.673977 0.541217 -0.176026
C  -1.118986 1.773604 -0.747306
H  -0.231272 2.42248 -0.794322
H  -1.517905 1.626987 -1.768746
H  -1.890885 2.255505 -0.118091
