program: Gaussian 09
title: 000068761
version: EM64L-G09RevD.01
frameworkgroup: C1[X(C18H24I3N3O9)]
method: RPBEPBE
basis: SDD
operation: Freq
keyword: #p
keyword: freq=noraman
keyword: PBEPBE/SDD
title: #p freq=noraman PBEPBE/SDD
converged: YES YES NO NO
title: Mulliken charges:
elementType: I I I O O O O O O O O O N N N C C C C C C C C C C C C C C C C C C H H H H H H H H H H H H H H H H H H H H H H H H
charge: 0.171662 0.138297 0.177173 -0.490143 -0.479048 -0.477177 -0.474953 -0.482094 -0.252597 -0.221246 -0.264141 -0.477666 -0.486868 -0.263379 -0.315357 -0.196112 -0.085836 -0.033508 -0.183155 -0.377745 0.119830 0.778108 0.735080 -0.712610 -0.763531 0.558270 -0.774831 0.045442 -0.625472 0.195204 -0.317380 -0.759493 -0.315650 0.285494 0.301199 0.232359 0.227071 0.203421 0.232477 0.374458 0.372929 0.393206 0.376073 0.385503 0.361378 0.241400 0.241962 0.279872 0.353099 0.242889 0.250316 0.246613 0.265313 0.262469 0.205422 0.215751 0.360256
chargesum: 0.00000
title: Mulliken charges with hydrogens summed into heavy atoms:
elementType: I I I O O O O O O O O O N N N C C C C C C C C C C C C C C C C C C
charge: 0.171662 0.138297 0.177173 -0.115685 -0.106118 -0.101104 -0.089450 -0.120716 -0.252597 -0.221246 -0.264141 -0.117410 -0.093662 -0.263379 0.037742 0.089382 0.215363 0.198851 0.043917 0.058153 0.119830 0.778108 0.735080 -0.712610 -0.763531 0.558270 -0.774831 0.045442 0.137761 0.195204 0.175824 0.014902 0.105522
chargesum: -0.00100
polarizability: 4.12374883e+02 1.17456502e+00 3.73129919e+02 8.68114488e+00 -8.52149805e+00 2.24889648e+02
1716.lowfreq: -29.4003 -9.4176 -2.7977 -0.6050 2.6869 4.6971 6.2824 14.4198 16.8768
frequency: 3.5590 12.9459 16.8669 22.2699 24.0190 32.0816 40.5007 46.3828 48.1292 51.8777 54.8927 66.3795 74.2915 81.0741 81.4868 88.8246 93.4396 94.6097 96.7296 107.6890 113.3545 123.2245 126.9469 133.3107 144.6702 160.3768 162.5663 166.4397 173.0352 191.5477 211.0860 231.9346 242.1376 243.2551 261.6485 267.3362 276.0758 282.2555 288.9927 306.2741 316.1776 333.9315 346.4232 348.4964 355.0746 378.3529 382.4296 408.3517 412.6402 422.9048 450.5129 461.6003 483.5530 485.2854 503.0560 520.5887 524.8883 554.7526 564.9740 583.2841 590.1435 616.8612 623.2664 640.0968 650.9383 666.8785 674.6732 689.8019 726.8987 736.8342 764.1580 797.9055 799.4288 820.7573 851.1034 864.5615 878.5988 892.4080 934.6999 946.8975 950.4400 963.9704 967.0869 996.6142 1010.5928 1018.9812 1026.6625 1034.2188 1038.4713 1051.1212 1057.3209 1065.4659 1069.5584 1091.1349 1093.0799 1124.8888 1128.1082 1162.8031 1166.5656 1175.4008 1178.3995 1191.0345 1203.9183 1218.5917 1227.3801 1230.5207 1237.3148 1266.1405 1268.0239 1275.4344 1296.1807 1301.5995 1306.3257 1315.0620 1327.9956 1337.4978 1346.8897 1355.1478 1359.6182 1362.7697 1365.9865 1381.3644 1384.3516 1394.8826 1403.2779 1421.3737 1424.8831 1447.4652 1461.5903 1465.6995 1468.7428 1472.2248 1478.8037 1482.6780 1483.5340 1508.2662 1517.1556 1520.6728 1604.4022 1615.7361 1622.9196 2927.1668 2963.0337 2965.8353 2983.3493 2985.9030 2993.7444 2996.6628 3028.8812 3049.5241 3056.0492 3070.6137 3084.1180 3084.6774 3094.1665 3112.1335 3133.4239 3252.7132 3367.8861 3455.5183 3521.5023 3528.9146 3589.0883 3595.2768 3602.0654
redmass: 7.5006 7.6610 12.8521 6.6412 7.7897 8.5321 6.4124 5.5343 5.3188 9.2500 5.4376 7.1741 7.3570 7.8536 6.6563 2.4242 13.8400 6.6986 8.8688 4.7649 1.1753 2.3252 1.8787 5.1316 4.2098 3.7437 49.2974 4.0401 7.4267 7.9507 5.8834 3.5659 1.3242 4.4093 5.2055 4.4987 4.0470 1.5385 4.8576 4.1942 3.9712 4.4795 5.7894 4.3530 1.2474 4.9630 3.8818 4.3593 6.8894 3.3189 3.9807 4.8214 2.8112 1.2932 2.6049 3.1031 2.0384 4.1985 3.2404 3.7088 1.1793 8.7113 4.7271 5.3333 2.9873 1.6892 6.4596 5.4752 5.7532 7.2182 6.8423 1.8653 3.5685 2.2589 2.7726 2.5413 3.6548 3.2262 6.4130 4.5424 3.2050 3.1547 5.3748 2.6044 5.1571 5.8171 2.3785 1.6541 3.1677 2.1978 2.6143 2.2587 2.3680 2.3096 2.4245 2.9840 1.4078 2.0114 1.1130 1.4000 1.2639 1.2510 1.2311 1.3567 1.4039 1.7787 2.0847 1.2188 1.2636 1.2459 10.4673 1.2574 4.1554 4.9736 1.2452 1.3964 1.3328 3.3877 1.4409 1.3860 3.8289 1.2531 1.4966 1.4571 1.4524 1.2707 1.8989 1.0793 1.0887 1.0813 1.0481 1.0869 1.0868 1.0807 1.9549 2.8163 4.6987 6.4428 9.3415 7.3841 6.1983 1.0816 1.0619 1.0555 1.0334 1.0814 1.0687 1.0374 1.1050 1.0986 1.0906 1.1025 1.0977 1.0976 1.0872 1.0992 1.0993 1.0809 1.0643 1.0645 1.0650 1.0779 1.0666 1.0669 1.0670
irintensity: 0.5336 0.1412 0.3153 1.4122 1.1093 0.3825 4.7191 1.3270 3.0671 4.1434 2.1986 0.4632 3.7424 1.9936 4.3053 2.8707 0.6569 1.0171 1.1109 2.5371 0.2051 0.9175 2.9847 4.0635 15.3007 2.0952 0.0329 1.9350 3.8069 2.7258 3.3936 31.7664 127.8913 1.0318 6.0589 36.1691 27.2558 116.8531 22.9207 0.6431 24.9634 11.5473 3.8834 55.7066 68.0587 1.6741 18.3559 10.6029 14.1239 22.6262 17.1317 32.1136 46.6801 170.7419 14.4368 2.9950 55.6222 19.2822 5.6106 10.0932 201.4825 3.2748 5.1357 1.6639 7.3843 65.0095 11.0118 53.1196 8.5857 1.2465 17.0306 69.7688 9.4779 35.1944 15.9055 18.0502 91.9278 11.8850 18.0992 50.4294 27.7292 52.0075 17.0428 66.0384 54.0268 30.6081 11.8139 6.2219 52.9295 39.3371 54.3833 22.3593 18.0636 30.2788 54.8932 6.3346 0.7800 40.4717 67.5940 87.9593 27.0490 31.0677 33.6663 28.3138 17.8782 128.6394 18.7961 5.1621 76.8648 31.8148 1.3023 11.7662 49.9556 38.8536 40.2908 48.9474 53.9606 124.2699 1.9281 146.4946 91.1968 34.8329 57.3462 7.8912 0.1727 85.2944 6.7787 38.7312 32.7972 10.5119 14.9255 5.4031 18.1614 48.7016 221.4213 321.2680 73.0806 67.9480 211.8822 261.1031 153.4768 30.1701 36.0512 63.4054 42.4874 31.8787 14.1015 4.9314 84.9073 19.4051 27.8283 14.9473 4.4383 6.3633 2.1172 0.1243 11.2861 463.5193 97.5241 43.1657 33.7849 56.1307 22.5999 7.3149 8.8836
temp: 298.150 k
press: 1.00000 atm
elementType: 53 53 53 8 8 8 8 8 8 8 8 8 7 7 7 6 6 6 6 6 6 6 6 6 6 6 6 6 6 6 6 6 6 1 1 1 1 1 1 1 1 1 1 1 1 1 1 1 1 1 1 1 1 1 1 1 1
symmnumber: 1
zpe: 1097067.1 jmol-1
zpe.correction: 0.417851 hartree
zpe.thermalcorrener: 0.456803 hartree
zpe.thermalcorrenthalpy: 0.457747 hartree
zpe.thermalcorrgfe: 0.336737 hartree
zpe.sumelectzpe: -1573.557781 hartree
zpe.sumelectthermal: -1573.518829 hartree
zpe.sumelectthermalent: -1573.517885 hartree
zpe.sumelectthermalfe: -1573.638895 hartree
dipole: 3.9184 7.9147 1.5586
dipole: 8.9681
quadrupole: -174.6659 -230.9948 -248.2714
quadrupole: -11.5166 -11.1091 20.6414
quadrupole: 43.3115 -13.0175 -30.2940 -11.5166 -11.1091 20.6414
hfenergy: -1573.975632 hartree
pointgroup: C01 [X(C18H24I3N3O9)]
dipole: 1.5466214 3.1084919 0.6278891 debye
polarizability: 411.9449418|1.1961832|373.0148688|12.5327018|-9.3953958|225.434639 unknown
InChI: InChI=1S/C18H24I3N3O9/c1-6(27)24(2)13-10(20)8(17(32)22-3-4-25)9(19)12(11(13)21)23-18(33)16(31)15(30)14(29)7(28)5-26/h7,14-16,22-23,25-26,28-31H,3-5H2,1-2H3
charge 0 multiplicity 1
57 atoms
I  0.894724 -2.734019 -0.043004
I  -0.919046 3.08498 -0.766546
I  -5.062224 -1.492498 -0.914516
O  5.599563 2.241761 -0.22135
O  3.447368 0.944842 -1.349591
O  6.024261 -1.42518 -0.309604
O  3.559639 1.075348 2.37538
O  8.430112 -0.768009 -1.37789
O  0.993616 0.376041 2.148597
O  -4.071721 1.873864 -2.393709
O  -2.87276 -5.070588 0.833839
O  -5.367553 3.514058 2.086117
N  0.978062 0.534772 -0.198454
N  -2.320874 -3.172821 -0.39593
N  -4.515859 2.096141 -0.110912
C  5.382224 0.825226 0.17797
C  3.890618 0.498785 -0.006896
C  6.26581 -0.039368 -0.731962
C  2.999987 1.216063 1.044812
C  7.756305 0.292475 -0.598476
C  1.554072 0.665461 1.046622
C  -0.359915 0.072822 -0.38614
C  -2.016319 -1.775574 -0.460903
C  -0.677539 -1.310643 -0.323143
C  -1.408265 0.994568 -0.644694
C  -2.748453 0.573007 -0.815451
C  -3.034069 -0.809763 -0.706013
C  -3.83977 1.571736 -1.184457
C  -2.307298 -3.937379 -1.663454
C  -2.61325 -3.833422 0.817443
C  -5.597914 3.078255 -0.252658
C  -2.603627 -2.974969 2.075851
C  -5.423795 4.196086 0.777763
H  5.651114 0.656175 1.23646
H  3.754585 -0.593377 0.022467
H  5.961989 0.093457 -1.791517
H  2.943906 2.29508 0.774235
H  8.064165 0.247881 0.467514
H  7.963089 1.296749 -1.011987
H  5.483437 2.820208 0.572914
H  3.928235 1.802064 -1.522845
H  1.59451 0.753967 -1.006824
H  6.745227 -1.968647 -0.725722
H  2.80685 0.767235 2.962508
H  9.411243 -0.679477 -1.303627
H  -1.296701 -3.933951 -2.110523
H  -3.031322 -3.513781 -2.38194
H  -2.594245 -4.972186 -1.418081
H  -4.279901 1.818927 0.846306
H  -6.57853 2.587463 -0.097363
H  -5.567331 3.475335 -1.281515
H  -3.374358 -2.184759 2.024157
H  -1.625448 -2.486147 2.231083
H  -2.819577 -3.629031 2.932834
H  -6.287026 4.890278 0.725254
H  -4.485199 4.754064 0.583731
H  -5.19962 4.167013 2.80894
