program: Gaussian 09
title: opt freq
version: AM64L-G09RevB.01
method: RTPSSTPSS
basis: SVP
operation: Freq
keyword: #P
keyword: Geom=AllCheck
keyword: Guess=TCheck
keyword: SCRF=Check
keyword: GenChk
keyword: RTPSSTPSS/SVP
keyword: Freq
multiplicity: 1
elementType: C C H H H C H H H O H
converged: YES YES NO YES
title: Mulliken atomic charges:
charge: -0.446073 0.030227 -0.035237 -0.109611 -0.031251 0.028007 -0.107895 -0.034348 -0.027480 -0.412845 0.146507
chargesum: -1.00000
title: Mulliken charges with hydrogens summed into heavy atoms:
elementType: C C C O
charge: -0.446073 -0.145872 -0.141716 -0.266339
polarizability: 7.15830103e+01 3.41413013e+00 7.43934620e+01 4.15788517e+00 5.20663906e+00 6.00182364e+01
1716.lowfreq: -0.0006 0.0005 0.0008 22.3966 36.2326 62.6854 111.9603 281.1761 300.3668
frequency: 111.7187 281.0340 300.3239 357.6262 390.9615 424.8948 748.4415 852.4188 890.6869 985.0832 1032.0096 1082.0887 1116.4645 1158.0820 1335.6816 1354.7348 1419.5337 1430.4059 1443.5909 1450.8689 2629.4590 2653.4931 2942.7655 2949.7823 2986.5841 2992.9868 3727.0978
redmass: 1.1219 1.0321 1.0668 2.1010 2.8328 2.2841 5.4573 3.0309 1.5798 1.2472 1.3857 1.6437 2.8071 1.6468 1.2739 1.2437 1.0577 1.0553 1.0500 1.0491 1.0671 1.0631 1.0607 1.0598 1.1009 1.1002 1.0678
irintensity: 96.0101 0.3776 2.8236 3.5160 0.4697 31.9829 170.8813 112.6083 4.6108 19.6650 61.2714 35.4692 14.1200 77.3797 19.0881 5.7278 11.9901 1.5314 12.8260 2.9090 267.2863 1428.5960 154.0542 97.9579 131.7279 155.0453 52.2101
temp: 298.150 k
press: 1.00000 atm
elementType: 6 6 1 1 1 6 1 1 1 8 1
symmnumber: 1
zpe: 233563.8 jmol-1
zpe.correction: 0.088960 hartree
zpe.thermalcorrener: 0.094727 hartree
zpe.thermalcorrenthalpy: 0.095671 hartree
zpe.thermalcorrgfe: 0.061127 hartree
zpe.sumelectzpe: -193.563916 hartree
zpe.sumelectthermal: -193.558148 hartree
zpe.sumelectthermalent: -193.557204 hartree
zpe.sumelectthermalfe: -193.591748 hartree
dipole: -0.4745 -3.8162 2.6224
dipole: 4.6546
quadrupole: -32.4728 -33.8350 -36.3927
quadrupole: 0.8588 -0.8586 0.2533
quadrupole: 1.7607 0.3985 -2.1592 0.8588 -0.8586 0.2533
hfenergy: -193.6528754 hartree
pointgroup: C01 [X(C3H7O1)]
dipole: -0.1214524 -0.0070208 -0.2579614 debye
dipolederiv: -0.3139061 -0.1899692 -0.5563521 -0.1931837 -0.4905265 -0.6921835 -0.6824941 -0.84731 -0.384648 0.416802 0.2188124 0.3927729 0.2805452 0.438879 0.2374411 0.2935528 0.3035351 0.7211688 -0.0639695 0.1271217 -0.0141659 0.1329367 -0.330155 0.0029021 -0.075036 0.0260516 -0.0163459 -0.3701748 -0.0366489 -0.1584102 -0.3020037 -0.1937424 -0.2659664 -0.5014886 -0.22175 -0.4342636 -0.0655461 -0.0486936 0.1320384 -0.1049186 -0.0208962 0.0932051 0.1311585 0.0815033 -0.2425307 0.3314903 0.2335176 0.1287739 0.1577672 0.5574209 0.4491156 0.2071693 0.3821826 0.704392 -0.1194033 -0.2353116 -0.2129719 0.0233422 -0.448266 -0.2123479 -0.0981594 -0.5503928 -0.4380316 -0.3748531 0.0800087 -0.0152733 0.0714102 -0.0254448 -0.0105102 0.0300631 -0.0687062 -0.010813 0.0043646 -0.0953151 0.0801077 -0.0369891 -0.0800517 0.1391111 0.0643854 0.128631 -0.2292135 -0.7347399 -0.0473841 0.2432192 -0.033274 -0.645803 0.2884195 0.6918792 0.8650614 -0.893227 0.2899358 -0.0061379 -0.0197387 0.0043677 0.2385856 -0.0291864 -0.0610303 -0.098806 0.2235125 unknown
polarizability: 71.5830103|3.4141301|74.393462|4.1578852|5.2066391|60.0182364 unknown
InChI: InChI=1/3C.O.7H
charge -1 multiplicity 1
11 atoms
C  0.233502 1.043093 -0.291884
C  -1.292152 1.119484 -0.365174
H  -1.65487 2.164501 -0.467493
H  -1.742035 0.554084 -1.242381
H  -1.77463 0.705544 0.547232
C  0.618678 -0.432877 -0.32197
H  0.196619 -1.000177 -1.212353
H  1.718386 -0.582149 -0.369322
H  0.261396 -0.972769 0.581067
O  0.700866 1.558432 -1.633489
H  1.166994 2.381685 -1.416207
