program: Orca
programVersion: 4.2.1
elementType: Cl O N N N C C C C C C C C C C C C C C C C C H H H H H H H H H H H H H H H H H H H H
charge: 0
multiplicity: 1
keywords: wb97x-d3
keywords: def2-TZVPP
keywords: def2/J RIJCOSX GRIDX6 NOFINALGRIDX
keywords: grid4 nofinalgrid
keywords: scfconv7
keywords: smallprint printgap noloewdin
keywords: NOSOSCF
formula: C17H20ClN3O
InChI: InChI=1/C17H20ClN3O/c1-16(2)8-7-14(9-13-3-5-15(18)6-4-13)17(16,22)10-21-12-19-11-20-21/h3-6,9,11-12,22H,7-8,10H2,1-2H3
42 atoms
Cl 5.936648 0.159315 -0.184438
O  -2.631772 0.142809 1.725663
N  -2.249257 -1.815111 -0.415786
N  -1.394029 -2.093672 -1.402718
N  -1.126935 -3.537707 0.292726
C  -3.096602 1.883581 0.008542
C  -2.447284 0.521359 0.385142
C  -2.397588 2.207196 -1.318368
C  -0.998679 0.719284 -0.018382
C  -0.961925 1.671912 -1.180033
C  -3.062022 -0.622956 -0.442874
C  -2.721759 2.933772 1.057258
C  -4.612801 1.834403 -0.118803
C  0.006153 0.136577 0.64164
C  1.443302 0.192783 0.386168
C  -2.068283 -2.672527 0.587959
C  2.298969 -0.334815 1.360861
C  2.030583 0.705645 -0.775349
C  -0.751597 -3.130428 -0.933305
C  3.673337 -0.346586 1.201229
C  3.404861 0.700577 -0.951173
C  4.219192 0.175873 0.039301
H  -2.420215 3.276073 -1.533638
H  -2.908775 1.715354 -2.14901
H  -0.248772 2.478408 -0.992577
H  -0.635262 1.179958 -2.099422
H  -3.176737 -0.345505 -1.487858
H  -4.052331 -0.867359 -0.057912
H  -3.065704 3.91701 0.732628
H  -3.191874 2.735669 2.022198
H  -1.643848 3.008575 1.219921
H  -5.082234 1.512429 0.8129
H  -5.003174 2.826616 -0.352791
H  -4.948283 1.166126 -0.913215
H  -2.100492 0.719863 2.286529
H  -0.254784 -0.480842 1.496577
H  -2.648427 -2.648767 1.495602
H  1.877888 -0.751019 2.267789
H  1.425627 1.097583 -1.578029
H  0.020273 -3.620693 -1.505524
H  4.30693 -0.761776 1.973041
H  3.83144 1.097574 -1.862137
elementType: Cl O N C H
totalener: -1359.61929717 hartree
nucrepener: 1956.91448233 hartree
electener: -3316.53377950 hartree
oneelecener: -5745.01636465 hartree
twoeener: 2428.48258515 hartree
cpcmener: -0.03068768 hartree
kineticenergy: 1355.01549381 hartree
xcener: -109.841443940178 hartree
chargesum: 0.0000000
charge: -0.102413 -0.418144 0.123285 -0.341385 -0.412125 0.225365 0.567357 -0.259357 -0.320976 -0.119625 -0.187902 -0.367185 -0.338826 -0.069637 0.052308 0.048734 -0.173143 -0.243857 0.049217 -0.180140 -0.172740 0.126725 0.083449 0.088420 0.120296 0.091132 0.131805 0.140846 0.097618 0.096965 0.114196 0.100662 0.104218 0.090970 0.229851 0.100197 0.167500 0.138490 0.171291 0.160325 0.144498 0.141732
qa: -0.1024 -0.4181 0.1233 -0.3414 -0.4121 0.2254 0.5674 -0.2594 -0.3210 -0.1196 -0.1879 -0.3672 -0.3388 -0.0696 0.0523 0.0487 -0.1731 -0.2439 0.0492 -0.1801 -0.1727 0.1267 0.0834 0.0884 0.1203 0.0911 0.1318 0.1408 0.0976 0.0970 0.1142 0.1007 0.1042 0.0910 0.2299 0.1002 0.1675 0.1385 0.1713 0.1603 0.1445 0.1417
va: 1.2045 2.0301 3.3871 2.8796 3.0255 3.7922 3.6229 4.0297 3.6084 3.8571 3.9008 3.9343 3.9024 3.6726 3.6575 4.0725 3.9884 3.9912 4.0524 4.0044 4.0417 3.7926 1.0153 1.0104 0.9924 1.0154 1.0076 0.9975 1.0055 1.0093 0.9930 1.0097 1.0029 1.0016 1.0086 1.0459 1.0092 1.0085 0.9892 0.9966 1.0064 1.0094
dispcorr: -0.023923269 hartree
energy: -1359.643220443565
dipole: -36.03765 34.17928 -1.85836 15.93558 -13.83399 2.10158 0.12896 0.03345 0.16241
magnitude: 2.81008 au
magnitude: 7.14265 debye
