program: Gaussian 09
title: 000073720
version: EM64L-G09RevD.01
frameworkgroup: C1[X(C9H14OSi)]
method: RPBEPBE
basis: SDD
operation: Freq
keyword: #p
keyword: freq=noraman
keyword: PBEPBE/SDD
title: #p freq=noraman PBEPBE/SDD
converged: NO NO NO NO
title: Mulliken charges:
elementType: Si O C C C C C C C C C H H H H H H H H H H H H H H
charge: 1.365551 -0.609035 -1.024593 -1.026890 -1.026897 0.398904 -0.361452 -0.376679 -0.221897 -0.192719 -0.259934 0.252868 0.227382 0.252871 0.253086 0.244157 0.235609 0.235604 0.244172 0.253081 0.220372 0.247597 0.220082 0.223555 0.225204
chargesum: 0.00000
title: Mulliken charges with hydrogens summed into heavy atoms:
elementType: Si O C C C C C C C C C
charge: 1.365551 -0.609035 -0.291471 -0.294038 -0.294040 0.398904 -0.141080 -0.129081 -0.001815 0.030836 -0.034730
polarizability: 1.61505826e+02 -1.95215987e+00 1.20870456e+02 -2.20484940e-04 2.26746744e-03 8.20197240e+01
1716.lowfreq: -0.0021 -0.0020 -0.0019 7.8118 17.4853 17.7932 21.9983 50.2642 94.4305
frequency: 19.7022 49.8424 94.4054 105.0927 116.4338 131.1341 175.4661 181.9567 195.8042 214.6976 239.8225 270.2239 351.3596 412.3558 487.4930 502.7595 583.8725 611.9388 667.7435 690.2632 697.9276 714.8065 749.6197 761.1637 805.7447 821.2120 822.8812 870.3017 890.6072 910.8305 918.1024 928.9161 959.3110 981.1080 983.6873 1020.4263 1075.8780 1165.6707 1174.1551 1251.5462 1301.3046 1304.0680 1309.4977 1319.3923 1376.6180 1435.7401 1441.1666 1443.9427 1445.6060 1449.0379 1449.1745 1460.4556 1478.9148 1584.5674 1609.7908 2983.8989 2984.9495 2989.0955 3082.5327 3083.6759 3089.4816 3097.3812 3098.0392 3102.9536 3120.6592 3128.4777 3143.7164 3157.9877 3169.8131
redmass: 3.1257 2.7576 3.7719 1.1672 1.0199 1.0373 2.8047 2.9725 2.6369 3.0984 2.9951 4.5192 4.6583 2.9098 7.4887 2.7619 4.4930 6.1897 5.9368 2.0232 2.7445 2.7818 1.1724 1.7089 1.3525 1.4326 1.2746 4.3238 1.4874 1.5924 1.5302 1.7015 1.3608 1.2999 6.0221 2.0366 1.5154 1.0691 1.1020 3.9918 1.3468 1.2046 1.2330 1.1972 6.2460 1.0537 2.1067 1.0541 1.0809 1.0469 1.0987 1.0545 2.3867 6.4145 6.3539 1.0352 1.0351 1.0352 1.0971 1.0971 1.0972 1.0987 1.0982 1.0986 1.0845 1.0882 1.0936 1.0959 1.0996
irintensity: 0.4674 1.1968 0.3467 0.0140 0.0268 0.0001 0.7539 1.2468 1.0498 1.0002 6.7258 12.4501 11.5654 0.0134 7.9684 9.4608 0.5314 3.7405 17.1263 17.1766 27.2489 9.2268 0.3747 78.6348 28.3697 13.2593 1.6560 52.2768 8.0441 93.8432 113.1662 391.1714 0.1042 0.9499 1.7968 12.5756 10.7566 4.9814 18.8279 318.5404 11.8608 54.2190 39.6094 34.2507 6.0424 0.3897 0.8492 0.0175 0.0466 6.8244 14.7800 12.1383 184.7441 13.0098 121.1479 9.5177 9.1358 10.3473 2.3479 23.9138 25.0251 3.1571 22.8264 13.1499 7.9898 6.7733 44.1942 27.4807 7.3224
temp: 298.150 k
press: 1.00000 atm
elementType: 14 8 6 6 6 6 6 6 6 6 6 1 1 1 1 1 1 1 1 1 1 1 1 1 1
symmnumber: 1
zpe: 533822.8 jmol-1
zpe.correction: 0.203322 hartree
zpe.thermalcorrener: 0.216908 hartree
zpe.thermalcorrenthalpy: 0.217853 hartree
zpe.thermalcorrgfe: 0.162213 hartree
zpe.sumelectzpe: -715.183615 hartree
zpe.sumelectthermal: -715.170029 hartree
zpe.sumelectthermalent: -715.169085 hartree
zpe.sumelectthermalfe: -715.224725 hartree
dipole: -1.7986 -1.1983 -0.0001
dipole: 2.1612
quadrupole: -66.0566 -70.8992 -77.6613
quadrupole: 1.2304 0.0000 0.0004
quadrupole: 5.4825 0.6398 -6.1223 1.2304 0.0000 0.0004
hfenergy: -715.3869373 hartree
pointgroup: C01 [X(C9H14O1Si1)]
dipole: -0.7056856 0.4743273 0.000035 debye
dipolederiv: 2.3772013 0.1033286 0.0000009 -0.3278644 1.290736 -0.0000089 -0.0000089 -0.0000057 1.4728163 -2.5972898 -0.1032956 -0.0000091 -0.1208159 -0.5052687 -0.0000019 0.0000415 0.0000071 -0.5264299 -0.40581 -0.1133843 0.0000033 -0.1211447 -0.399602 0.0000009 -0.0000009 -0.0000003 -0.3300656 -0.4318782 -0.0349958 0.0085587 0.0734514 -0.3702986 -0.0806964 0.0393615 -0.1019598 -0.467652 -0.4318678 -0.035037 -0.0085634 0.0734594 -0.3702853 0.0806978 -0.0393617 0.1019675 -0.4676489 1.8891839 0.100382 -0.0000003 0.5363072 0.1182832 0.000003 -0.0000338 -0.0000043 0.1197713 -0.2729798 -0.0013466 0.0000005 -0.4500971 -0.0780515 0.0000106 -0.0000141 0.000015 -0.2083456 -0.482785 -0.0440755 -0.0000003 0.1892145 0.053269 0.0000138 0.0000155 0.0000162 -0.1946568 0.156542 -0.0786465 0.0000013 0.0676851 0.142866 0.0000177 0.0000069 0.0000126 -0.1410044 0.1670144 0.025164 0.0000078 -0.0119732 0.1525688 0.0000122 0.0000065 0.0000136 -0.1384431 -0.065111 0.073578 0.0000037 0.0199707 -0.2008953 0.0000004 -0.0000061 -0.0000006 -0.2086594 0.1262771 0.0022981 0.0104602 0.0065851 0.0128009 0.1282631 -0.0074617 0.10581 -0.0306125 -0.14714 0.0614885 -0.0000139 0.0540882 0.0886322 0.0000016 -0.0000096 0.0000014 0.1078914 0.1262794 0.0023034 -0.0104498 0.0065972 0.0127795 -0.1282612 0.0074731 -0.1058132 -0.0305849 0.1127611 0.0120516 -0.0245439 -0.0075923 0.0610349 0.0745127 -0.0339887 0.0982171 -0.0849083 0.0355739 -0.1220513 -0.0244764 -0.1569524 -0.0309818 -0.0080269 -0.0596072 -0.020259 0.1044388 -0.1103036 0.0981252 0.0303254 0.1271448 0.0680959 -0.0099819 0.0786631 -0.011466 0.1050252 -0.1102701 0.0981695 -0.0302924 0.1271873 0.0680373 0.0099726 -0.07863 0.0114589 0.1050355 0.0355333 -0.1220418 0.0245068 -0.1569679 -0.0309193 0.0080564 0.0596537 0.0202803 0.1044317 0.1127634 0.0120307 0.024487 -0.007617 0.0610193 -0.0745351 0.033907 -0.0982389 -0.0849125 -0.0529755 0.1139938 0.0000037 0.1364739 -0.0067638 -0.0000092 0.0000056 -0.0000122 0.1494472 0.0869227 -0.0636057 -0.0000054 -0.0482938 -0.0593706 -0.0000122 -0.0000032 -0.000012 0.1662988 0.0592506 -0.0440359 -0.0000032 -0.0736598 -0.1203237 -0.0000165 -0.000008 -0.0000149 0.1533495 -0.0430714 0.1132071 0.0000031 0.120791 -0.0272741 -0.0000067 0.0000008 -0.0000083 0.153219 -0.133821 -0.0536046 -0.0000043 -0.0559771 0.0699114 -0.0000058 -0.0000012 -0.0000047 0.1721991 unknown
polarizability: 161.5210483|1.7866516|120.8552331|0.0002297|0.0022666|82.019724 unknown
InChI: InChI=1S/C9H14OSi/c1-11(2,3)10-9-7-5-4-6-8-9/h4-8H,1-3H3
charge 0 multiplicity 1
25 atoms
Si -2.321419 0.062866 -0.000153
O  -0.77857 -0.801695 -0.000179
C  -3.564078 -1.366999 -0.000112
C  -2.452312 1.125895 1.577667
C  -2.452331 1.125828 -1.578016
C  0.540232 -0.367896 -0.000198
C  0.914431 1.003323 -0.000115
C  1.545734 -1.369856 -0.000232
C  2.28181 1.35801 -0.000077
C  2.906648 -1.00158 -0.000197
C  3.285675 0.363008 -0.000121
H  -3.427926 -2.001716 0.892979
H  -4.604225 -0.990152 -0.000168
H  -3.427861 -2.001816 -0.893121
H  -2.290578 0.505773 2.477577
H  -1.710328 1.943796 1.590007
H  -3.459194 1.579311 1.652641
H  -3.459104 1.579521 -1.652815
H  -1.710129 1.943523 -1.590566
H  -2.290958 0.505602 -2.477918
H  0.14419 1.783005 -0.000064
H  1.232029 -2.418402 -0.000288
H  2.560756 2.41848 -0.00001
H  3.674875 -1.78378 -0.000221
H  4.343937 0.644651 -0.000101
