program: Orca
programVersion: 4.2.1
elementType: Cl O N N N C C C C C C C C C C C C C C C C C H H H H H H H H H H H H H H H H H H H H
charge: 0
multiplicity: 1
keywords: wb97x-d3
keywords: def2-TZVPP
keywords: def2/J RIJCOSX GRIDX6 NOFINALGRIDX
keywords: grid4 nofinalgrid
keywords: scfconv7
keywords: smallprint printgap noloewdin
keywords: NOSOSCF
formula: C17H20ClN3O
InChI: InChI=1/C17H20ClN3O/c1-16(2)8-7-14(9-13-3-5-15(18)6-4-13)17(16,22)10-21-12-19-11-20-21/h3-6,9,11-12,22H,7-8,10H2,1-2H3
42 atoms
Cl 5.977103 0.191969 -0.201444
O  -2.598583 0.137498 1.689648
N  -2.232501 -1.825722 -0.405045
N  -2.38005 -2.679918 0.608478
N  -0.761673 -3.380078 -0.772197
C  -3.092695 1.892554 -0.000273
C  -2.41236 0.538188 0.362167
C  -2.384995 2.26556 -1.308505
C  -0.965579 0.775066 -0.033865
C  -0.934336 1.782068 -1.15048
C  -2.992018 -0.604202 -0.497257
C  -2.758638 2.929677 1.0758
C  -4.605937 1.811484 -0.148728
C  0.041537 0.154966 0.588814
C  1.480454 0.221889 0.34541
C  -1.260541 -2.252297 -1.215612
C  2.322094 -0.435485 1.250795
C  2.084221 0.870313 -0.737411
C  -1.481766 -3.594688 0.346544
C  3.696902 -0.448156 1.097775
C  3.459063 0.865859 -0.905692
C  4.25928 0.20643 0.013261
H  -2.442884 3.336581 -1.508008
H  -2.861822 1.769707 -2.157663
H  -0.262839 2.608622 -0.903434
H  -0.557944 1.352425 -2.082792
H  -3.020061 -0.319581 -1.547996
H  -4.014247 -0.824224 -0.190638
H  -1.685428 3.026527 1.259487
H  -3.118491 3.91273 0.767079
H  -3.240526 2.703254 2.02905
H  -5.01838 2.800948 -0.356733
H  -4.918485 1.161943 -0.967943
H  -5.079705 1.45015 0.766663
H  -2.11975 0.74083 2.269044
H  -0.228183 -0.513001 1.402457
H  -0.962384 -1.722961 -2.107228
H  1.890154 -0.954479 2.097938
H  1.492562 1.378213 -1.482871
H  -1.34305 -4.454946 0.983295
H  4.318976 -0.966224 1.815149
H  3.897997 1.371043 -1.755539
elementType: Cl O N C H
totalener: -1359.62721170 hartree
nucrepener: 1947.06171760 hartree
electener: -3306.68892930 hartree
oneelecener: -5725.10778985 hartree
twoeener: 2418.41886055 hartree
cpcmener: -0.03247449 hartree
kineticenergy: 1354.98643192 hartree
xcener: -109.836023999955 hartree
chargesum: 0.0000000
charge: -0.099271 -0.393795 0.129778 -0.345242 -0.401850 0.217385 0.575955 -0.257861 -0.335392 -0.114787 -0.204204 -0.368157 -0.338943 -0.091483 0.084019 0.050627 -0.169234 -0.244403 0.051773 -0.176999 -0.168066 0.124922 0.083284 0.087089 0.116885 0.092774 0.144796 0.124124 0.113531 0.096816 0.097727 0.103350 0.089757 0.101919 0.221115 0.093952 0.165641 0.137107 0.164367 0.159689 0.142067 0.139237
qa: -0.0993 -0.3938 0.1298 -0.3452 -0.4018 0.2174 0.5760 -0.2579 -0.3354 -0.1148 -0.2042 -0.3682 -0.3389 -0.0915 0.0840 0.0506 -0.1692 -0.2444 0.0518 -0.1770 -0.1681 0.1249 0.0833 0.0871 0.1169 0.0928 0.1448 0.1241 0.1135 0.0968 0.0977 0.1034 0.0898 0.1019 0.2211 0.0940 0.1656 0.1371 0.1644 0.1597 0.1421 0.1392
va: 1.2077 2.0557 3.3722 2.8979 3.0305 3.7923 3.6065 4.0171 3.6408 3.8580 3.9150 3.9371 3.9022 3.6786 3.6588 4.0742 3.9975 3.9976 4.0492 4.0094 4.0482 3.8075 1.0159 1.0122 0.9932 1.0070 0.9894 1.0146 0.9930 1.0059 1.0095 1.0031 1.0012 1.0098 1.0141 1.0589 0.9959 1.0086 0.9934 0.9960 1.0071 1.0099
dispcorr: -0.023601246 hartree
energy: -1359.650812946689
dipole: -35.49704 34.24737 -1.24967 16.43371 -14.02848 2.40523 -1.23249 0.43183 -0.80066
magnitude: 2.82628 au
magnitude: 7.18383 debye
