program: Orca
programVersion: 4.2.1
elementType: Cl O N N N C C C C C C C C C C C C C C C C C H H H H H H H H H H H H H H H H H H H H
charge: 0
multiplicity: 1
keywords: wb97x-d3
keywords: def2-TZVPP
keywords: def2/J RIJCOSX GRIDX6 NOFINALGRIDX
keywords: grid4 nofinalgrid
keywords: scfconv7
keywords: smallprint printgap noloewdin
keywords: NOSOSCF
formula: C17H20ClN3O
InChI: InChI=1/C17H20ClN3O/c1-16(2)8-7-14(9-13-3-5-15(18)6-4-13)17(16,22)10-21-12-19-11-20-21/h3-6,9,11-12,22H,7-8,10H2,1-2H3
42 atoms
Cl 5.905606 0.072509 -0.199036
O  -2.699558 0.095166 1.693189
N  -2.154672 -1.76322 -0.46188
N  -1.252119 -2.00744 -1.416244
N  -1.069495 -3.513581 0.233509
C  -3.165147 1.89415 0.039245
C  -2.462034 0.549625 0.387169
C  -2.386086 2.334801 -1.206562
C  -1.001691 0.839515 0.083468
C  -0.926387 1.959688 -0.918117
C  -2.98069 -0.587422 -0.517572
C  -2.933511 2.894334 1.17581
C  -4.663977 1.775025 -0.205667
C  -0.016212 0.134039 0.643389
C  1.425067 0.190436 0.413383
C  -2.028072 -2.66782 0.519652
C  2.18043 -0.926259 0.784451
C  2.106725 1.272534 -0.147556
C  -0.62783 -3.065408 -0.960974
C  3.549342 -0.975669 0.596722
C  3.477944 1.240872 -0.333661
C  4.195087 0.114804 0.036591
H  -2.511238 3.399048 -1.412383
H  -2.749243 1.806507 -2.091862
H  -0.397047 2.819014 -0.498383
H  -0.378944 1.666317 -1.817089
H  -3.012744 -0.283718 -1.561232
H  -3.994955 -0.852116 -0.213417
H  -3.290801 3.882326 0.881771
H  -3.480579 2.612485 2.076541
H  -1.87916 3.00081 1.4419
H  -4.902856 1.170516 -1.081878
H  -5.172549 1.338508 0.655948
H  -5.09956 2.761232 -0.374819
H  -2.147451 0.599892 2.297651
H  -0.309211 -0.654236 1.331656
H  -2.645405 -2.670341 1.403626
H  1.677774 -1.784289 1.214823
H  1.576661 2.168327 -0.432807
H  0.173342 -3.533117 -1.511248
H  4.110064 -1.854103 0.884285
H  3.987874 2.091801 -0.763734
totalener: -1359.59941793 hartree
nucrepener: 1960.21075275 hartree
electener: -3319.81017069 hartree
oneelecener: -5751.28944811 hartree
twoeener: 2431.47927742 hartree
kineticenergy: 1354.99854862 hartree
xcener: -109.835216984774 hartree
chargesum: 0.0000000
charge: -0.082126 -0.349112 0.110533 -0.293978 -0.330838 0.256464 0.478408 -0.263999 -0.247851 -0.153565 -0.194781 -0.382526 -0.325113 -0.102458 0.105686 0.022479 -0.161140 -0.211635 0.045697 -0.176730 -0.145938 0.122632 0.078581 0.087722 0.097611 0.115662 0.122002 0.127544 0.093053 0.102197 0.102730 0.083020 0.106851 0.097310 0.189451 0.112914 0.148858 0.117863 0.128948 0.129357 0.122053 0.116163
qa: -0.0821 -0.3491 0.1105 -0.2940 -0.3308 0.2565 0.4784 -0.2640 -0.2479 -0.1536 -0.1948 -0.3825 -0.3251 -0.1025 0.1057 0.0225 -0.1611 -0.2116 0.0457 -0.1767 -0.1459 0.1226 0.0786 0.0877 0.0976 0.1157 0.1220 0.1275 0.0931 0.1022 0.1027 0.0830 0.1069 0.0973 0.1895 0.1129 0.1489 0.1179 0.1289 0.1294 0.1221 0.1162
va: 1.2257 2.0883 3.3527 2.8459 3.0372 3.6957 3.7510 4.0371 3.6019 3.8974 3.9262 3.9458 3.9063 3.7939 3.6593 4.0709 4.0168 4.0254 4.0447 4.0686 4.0594 3.9022 1.0185 1.0125 0.9942 1.0061 1.0144 0.9956 1.0099 1.0093 0.9958 1.0024 1.0087 1.0067 1.0462 1.0263 1.0122 1.0232 1.0033 1.0045 1.0139 1.0172
dispcorr: -0.024341663 hartree
energy: -1359.623759594957
dipole: -36.42522 35.14557 -1.27965 16.25271 -14.73868 1.51403 0.57001 -0.41859 0.15142
magnitude: 1.98814 au
magnitude: 5.05345 debye
