program: Orca
programVersion: 4.2.1
elementType: Cl O N N N C C C C C C C C C C C C C C C C C H H H H H H H H H H H H H H H H H H H H
charge: 0
multiplicity: 1
keywords: wb97x-d3
keywords: def2-TZVPP
keywords: def2/J RIJCOSX GRIDX6 NOFINALGRIDX
keywords: grid4 nofinalgrid
keywords: scfconv7
keywords: smallprint printgap noloewdin
keywords: NOSOSCF
formula: C17H20ClN3O
InChI: InChI=1/C17H20ClN3O/c1-16(2)8-7-14(9-13-3-5-15(18)6-4-13)17(16,22)10-21-12-19-11-20-21/h3-6,9,11-12,22H,7-8,10H2,1-2H3
42 atoms
Cl 5.957962 0.343803 -0.13409
O  -2.61477 0.201047 1.701687
N  -2.285026 -1.853056 -0.31368
N  -1.443425 -2.211984 -1.287323
N  -1.268484 -3.613994 0.452724
C  -3.085793 1.878149 -0.069818
C  -2.436444 0.526962 0.350469
C  -2.394266 2.156297 -1.410605
C  -0.990938 0.708501 -0.070202
C  -0.957055 1.628314 -1.258564
C  -3.062969 -0.649485 -0.4218
C  -2.701707 2.963321 0.940652
C  -4.60424 1.829796 -0.181457
C  0.020331 0.144167 0.594423
C  1.458563 0.217905 0.349701
C  -2.161496 -2.695102 0.721868
C  2.049298 0.716691 -0.814571
C  2.314319 -0.26062 1.346977
C  -0.858172 -3.272122 -0.786447
C  3.4247 0.757615 -0.964775
C  3.689633 -0.225804 1.212516
C  4.242031 0.291744 0.051991
H  -2.422891 3.215777 -1.669388
H  -2.908355 1.632443 -2.219947
H  -0.244641 2.441421 -1.096128
H  -0.632154 1.103879 -2.160695
H  -3.147149 -0.42915 -1.483813
H  -4.067034 -0.839267 -0.038453
H  -1.622947 3.032233 1.100382
H  -3.035279 3.93841 0.582687
H  -3.178995 2.801976 1.908636
H  -5.059849 1.516262 0.75954
H  -4.999683 2.81805 -0.422052
H  -4.948093 1.153539 -0.965447
H  -2.045339 0.767922 2.230569
H  -0.240152 -0.474067 1.449458
H  -2.735691 -2.601032 1.62972
H  1.441282 1.058346 -1.637354
H  1.889956 -0.675068 2.253307
H  -0.109874 -3.821445 -1.335768
H  3.859456 1.143643 -1.87642
H  4.327214 -0.60217 2.000345
totalener: -1359.59987022 hartree
nucrepener: 1950.72529318 hartree
electener: -3310.32516340 hartree
oneelecener: -5732.32118936 hartree
twoeener: 2421.99602596 hartree
kineticenergy: 1355.00094231 hartree
xcener: -109.835470199862 hartree
chargesum: -0.0000000
charge: -0.081056 -0.350312 0.115178 -0.304531 -0.328555 0.240832 0.532741 -0.279246 -0.277906 -0.143440 -0.219767 -0.375006 -0.329926 -0.073154 0.067153 0.026459 -0.205645 -0.138735 0.056815 -0.144893 -0.160965 0.118830 0.077911 0.087047 0.115078 0.095747 0.125584 0.128735 0.111010 0.091655 0.097446 0.107157 0.097747 0.081951 0.187293 0.090941 0.146790 0.140667 0.107355 0.128323 0.116775 0.119918
qa: -0.0811 -0.3503 0.1152 -0.3045 -0.3286 0.2408 0.5327 -0.2792 -0.2779 -0.1434 -0.2198 -0.3750 -0.3299 -0.0732 0.0672 0.0265 -0.2056 -0.1387 0.0568 -0.1449 -0.1610 0.1188 0.0779 0.0870 0.1151 0.0957 0.1256 0.1287 0.1110 0.0917 0.0974 0.1072 0.0977 0.0820 0.1873 0.0909 0.1468 0.1407 0.1074 0.1283 0.1168 0.1199
va: 1.2272 2.0926 3.3606 2.8545 3.0583 3.7317 3.6728 4.0516 3.5908 3.8622 3.9535 3.9352 3.9067 3.7385 3.7531 4.0777 4.0214 4.0171 4.0528 4.0483 4.0419 3.9046 1.0185 1.0104 0.9919 1.0117 1.0100 0.9956 0.9945 1.0106 1.0094 1.0093 1.0066 1.0022 1.0487 1.0440 1.0120 0.9998 1.0164 1.0031 1.0168 1.0142
dispcorr: -0.023713291 hartree
energy: -1359.623583508176
dipole: -35.90733 34.70792 -1.19940 15.29832 -13.74327 1.55505 -0.75647 0.80828 0.05181
magnitude: 1.96454 au
magnitude: 4.99347 debye
