program: Orca
programVersion: 4.2.1
elementType: O N N N C C C C C C C C C C C H H H H H H H H H H H H H H H C C C C C C H H H H Cl H
charge: 0
multiplicity: 1
keywords: wb97x-d3
keywords: def2-TZVPP
keywords: def2/J RIJCOSX GRIDX6 NOFINALGRIDX
keywords: grid4 nofinalgrid
keywords: scfconv7
keywords: smallprint printgap noloewdin
keywords: NOSOSCF
formula: C17H20ClN3O
InChI: InChI=1/C17H20ClN3O/c1-16(2)8-7-14(9-13-3-5-15(18)6-4-13)17(16,22)10-21-12-19-11-20-21/h3-6,9,11-12,22H,7-8,10H2,1-2H3
42 atoms
O  1.206472 0.733462 -1.349738
N  0.757442 -2.003571 -0.445588
N  0.375266 -2.577117 0.697458
N  -1.264443 -2.710118 -0.828117
C  3.460059 0.729574 -0.47286
C  2.023016 0.143371 -0.371827
C  4.085992 0.259351 0.846961
C  1.670921 0.417091 1.078814
C  2.952216 0.322286 1.879733
C  2.052326 -1.385811 -0.605474
C  3.385874 2.259083 -0.48483
C  4.250235 0.265369 -1.689589
C  0.497873 0.682777 1.650495
C  -0.231623 -2.085843 -1.339585
C  -0.838525 -2.978563 0.419404
H  4.939378 0.878465 1.125978
H  4.465487 -0.760093 0.748099
H  3.049833 1.188536 2.535547
H  2.947573 -0.556219 2.528222
H  2.736251 -1.895043 0.070008
H  2.384932 -1.58812 -1.6229
H  2.790959 2.659733 0.338421
H  4.391048 2.673824 -0.390537
H  2.961594 2.642172 -1.412652
H  3.746438 0.520768 -2.623732
H  5.225871 0.754632 -1.70469
H  4.438209 -0.808952 -1.689355
H  0.279016 0.553677 -1.163193
H  -0.146648 -1.714864 -2.349017
H  -1.438679 -3.502607 1.146562
C  -0.848028 0.791462 1.053712
C  -3.444755 0.95759 0.05493
C  -1.195323 1.768281 0.118824
C  -1.851282 -0.066628 1.508874
C  -3.141281 0.003618 1.013734
C  -2.484139 1.849014 -0.390906
H  -0.462034 2.495563 -0.203988
H  -1.618656 -0.80719 2.262579
H  -3.898684 -0.679744 1.372526
H  -2.731374 2.608917 -1.119597
Cl -5.055002 1.04707 -0.578943
H  0.506792 0.785158 2.733777
elementType: O N C H Cl
totalener: -1359.60786868 hartree
nucrepener: 2022.27087750 hartree
electener: -3381.87874619 hartree
oneelecener: -5875.78762644 hartree
twoeener: 2493.90888025 hartree
cpcmener: -0.02732718 hartree
kineticenergy: 1355.00128591 hartree
xcener: -109.837895234459 hartree
chargesum: -0.0000000
charge: -0.440499 0.126478 -0.334473 -0.394475 0.237914 0.617916 -0.245988 -0.348519 -0.106990 -0.218558 -0.359870 -0.353209 -0.039961 0.019815 0.032960 0.081249 0.087777 0.104745 0.094853 0.134605 0.144058 0.102930 0.099921 0.093401 0.103996 0.105024 0.093031 0.233487 0.184764 0.165117 -0.038374 0.124590 -0.198154 -0.189303 -0.163995 -0.175904 0.164398 0.145354 0.142984 0.146567 -0.102922 0.123258
qa: -0.4405 0.1265 -0.3345 -0.3945 0.2379 0.6179 -0.2460 -0.3485 -0.1070 -0.2186 -0.3599 -0.3532 -0.0400 0.0198 0.0330 0.0812 0.0878 0.1047 0.0949 0.1346 0.1441 0.1029 0.0999 0.0934 0.1040 0.1050 0.0930 0.2335 0.1848 0.1651 -0.0384 0.1246 -0.1982 -0.1893 -0.1640 -0.1759 0.1644 0.1454 0.1430 0.1466 -0.1029 0.1233
va: 2.0285 3.3757 2.8723 3.0210 3.7282 3.5520 3.9933 3.9129 3.8556 3.9489 3.9474 3.9091 3.7393 4.0647 4.0681 1.0171 1.0099 1.0039 1.0119 1.0084 0.9899 0.9973 1.0057 1.0143 1.0081 1.0020 0.9999 1.0412 0.9980 0.9957 3.5409 3.8064 3.9011 3.9392 3.9970 4.0402 1.0070 1.0064 1.0066 1.0067 1.2036 0.9996
dispcorr: -0.026626125 hartree
energy: -1359.634494809889
dipole: 39.37924 -37.15862 2.22062 3.70707 -3.36373 0.34333 1.20734 -0.81846 0.38888
magnitude: 2.28041 au
magnitude: 5.79633 debye
