program: Orca
programVersion: 4.2.1
elementType: O N N N C C C C C C C C C C C H H H H H H H H H H H H H H H C C C C C C H H H H Cl H
charge: 0
multiplicity: 1
keywords: wb97x-d3
keywords: def2-TZVPP
keywords: def2/J RIJCOSX GRIDX6 NOFINALGRIDX
keywords: grid4 nofinalgrid
keywords: scfconv7
keywords: smallprint printgap noloewdin
keywords: NOSOSCF
formula: C17H20ClN3O
InChI: InChI=1/C17H20ClN3O/c1-16(2)8-7-14(9-13-3-5-15(18)6-4-13)17(16,22)10-21-12-19-11-20-21/h3-6,9,11-12,22H,7-8,10H2,1-2H3
42 atoms
O  0.929774 0.32202 -1.385031
N  1.052063 -2.409003 -0.380994
N  0.817289 -2.86325 0.852329
N  -0.764158 -3.590888 -0.563798
C  3.226242 0.745749 -0.537342
C  1.882737 -0.052605 -0.42787
C  3.926911 0.401049 0.788842
C  1.518933 0.208007 1.018385
C  2.801294 0.125115 1.805158
C  2.164718 -1.542697 -0.679174
C  2.922826 2.24535 -0.589892
C  4.061559 0.379227 -1.757705
C  0.381829 0.643892 1.567215
C  0.101216 -2.843525 -1.209104
C  -0.27774 -3.562404 0.692039
H  4.578214 1.214756 1.109942
H  4.566847 -0.47551 0.671573
H  2.798985 0.831184 2.635479
H  2.909577 -0.870147 2.244041
H  3.01589 -1.889919 -0.097355
H  2.411282 -1.690256 -1.730264
H  2.422693 2.531811 -1.517197
H  2.305342 2.584443 0.24461
H  3.856355 2.808378 -0.547723
H  4.939693 1.025444 -1.816407
H  4.427408 -0.648191 -1.729502
H  3.499453 0.51273 -2.684708
H  0.585712 1.195272 -1.168278
H  0.083962 -2.607396 -2.261449
H  -0.739763 -4.084163 1.515843
C  -0.954466 0.871455 0.99738
C  -3.515519 1.418756 0.028282
C  -1.650054 2.018469 1.393719
C  -1.600304 -0.010281 0.130642
C  -2.86897 0.256053 -0.35894
C  -2.916672 2.303681 0.912033
H  -1.188362 2.710347 2.08796
H  -1.12151 -0.931012 -0.159013
H  -3.347542 -0.443381 -1.031385
H  -3.427701 3.203943 1.225532
Cl -5.099103 1.761927 -0.584895
H  0.455652 0.936943 2.612029
elementType: O N C H Cl
totalener: -1359.60979170 hartree
nucrepener: 1991.53162993 hartree
electener: -3351.14142163 hartree
oneelecener: -5814.35795607 hartree
twoeener: 2463.21653444 hartree
cpcmener: -0.02911732 hartree
kineticenergy: 1354.98278246 hartree
xcener: -109.835272636243 hartree
chargesum: -0.0000000
charge: -0.417055 0.135905 -0.339736 -0.411697 0.216637 0.654329 -0.271436 -0.406800 -0.061029 -0.252540 -0.366954 -0.345950 -0.076559 0.053541 0.050730 0.081619 0.087637 0.094160 0.091874 0.152157 0.137508 0.095620 0.115920 0.098518 0.106404 0.090131 0.101178 0.231724 0.174283 0.160745 -0.037408 0.143905 -0.128769 -0.093951 -0.197783 -0.204239 0.140862 0.099698 0.136351 0.144975 -0.102600 0.118096
qa: -0.4171 0.1359 -0.3397 -0.4117 0.2166 0.6543 -0.2714 -0.4068 -0.0610 -0.2525 -0.3670 -0.3459 -0.0766 0.0535 0.0507 0.0816 0.0876 0.0942 0.0919 0.1522 0.1375 0.0956 0.1159 0.0985 0.1064 0.0901 0.1012 0.2317 0.1743 0.1607 -0.0374 0.1439 -0.1288 -0.0940 -0.1978 -0.2042 0.1409 0.0997 0.1364 0.1450 -0.1026 0.1181
va: 2.0429 3.3539 2.8739 3.0040 3.7900 3.5156 4.0136 3.9457 3.8239 3.9206 3.9271 3.8990 3.7582 4.0389 4.0421 1.0125 1.0095 1.0119 1.0197 0.9958 0.9993 1.0092 0.9947 1.0063 1.0022 1.0007 1.0110 1.0095 0.9976 0.9973 3.6081 3.7890 3.9293 3.8798 4.0685 4.0230 1.0046 0.9651 1.0136 1.0058 1.2041 1.0083
dispcorr: -0.025187568 hartree
energy: -1359.634979266631
dipole: 38.21471 -35.55707 2.65765 3.53947 -2.19604 1.34343 0.35189 -0.29326 0.05863
magnitude: 2.97848 au
magnitude: 7.57069 debye
