program: Orca
programVersion: 4.2.1
elementType: O N N N C C C C C C C C C C C H H H H H H H H H H H H H H H C C C C C C H H H H Cl H
charge: 0
multiplicity: 1
keywords: wb97x-d3
keywords: def2-TZVPP
keywords: def2/J RIJCOSX GRIDX6 NOFINALGRIDX
keywords: grid4 nofinalgrid
keywords: scfconv7
keywords: smallprint printgap noloewdin
keywords: NOSOSCF
formula: C17H20ClN3O
InChI: InChI=1/C17H20ClN3O/c1-16(2)8-7-14(9-13-3-5-15(18)6-4-13)17(16,22)10-21-12-19-11-20-21/h3-6,9,11-12,22H,7-8,10H2,1-2H3
42 atoms
O  1.081847 0.757425 -1.267912
N  0.776299 -1.998044 -0.561966
N  0.568172 -2.799274 0.486337
N  -1.2301 -2.783089 -0.854505
C  3.416829 0.791426 -0.420842
C  1.98357 0.175584 -0.36478
C  4.062776 0.222289 0.848852
C  1.645246 0.303147 1.107611
C  2.9311 0.140296 1.886411
C  2.028838 -1.308522 -0.759147
C  3.314083 2.314956 -0.304129
C  4.194328 0.448746 -1.683792
C  0.474586 0.533887 1.697295
C  -0.30533 -1.991431 -1.341598
C  -0.643891 -3.240102 0.267088
H  4.893309 0.842729 1.187777
H  4.479466 -0.767908 0.651682
H  3.017155 0.919633 2.644618
H  2.947146 -0.812384 2.419857
H  2.781798 -1.850917 -0.192433
H  2.292173 -1.39462 -1.813561
H  4.312131 2.745088 -0.207967
H  2.862769 2.768208 -1.189365
H  2.741277 2.639094 0.568305
H  5.159127 0.95928 -1.679655
H  4.402628 -0.617837 -1.77612
H  3.662802 0.768642 -2.582358
H  0.931528 1.675787 -1.024234
H  -0.369259 -1.42414 -2.255492
H  -1.122142 -3.932044 0.942752
C  -0.864183 0.718149 1.099551
C  -3.443862 1.047624 0.102544
C  -1.849628 -0.239802 1.328521
C  -1.21775 1.866091 0.393252
C  -2.496893 2.035556 -0.113814
C  -3.133179 -0.089549 0.829137
H  -1.612135 -1.125402 1.903334
H  -0.49745 2.663086 0.253685
H  -2.749304 2.932031 -0.663491
H  -3.877961 -0.853209 1.006908
Cl -5.045777 1.245961 -0.532224
H  0.481217 0.560072 2.785513
elementType: O N C H Cl
totalener: -1359.60874540 hartree
nucrepener: 2017.49655339 hartree
electener: -3377.10529879 hartree
oneelecener: -5866.51784591 hartree
twoeener: 2489.41254712 hartree
cpcmener: -0.02978835 hartree
kineticenergy: 1355.00633251 hartree
xcener: -109.837604756258 hartree
chargesum: -0.0000000
charge: -0.423268 0.132418 -0.343259 -0.403545 0.221669 0.650737 -0.246542 -0.403246 -0.095365 -0.213605 -0.380897 -0.351168 -0.030328 0.068372 0.023509 0.081223 0.087658 0.102731 0.094511 0.134468 0.142632 0.101147 0.098260 0.114906 0.105182 0.091989 0.101037 0.223735 0.160459 0.165289 0.055850 0.113762 -0.216707 -0.212195 -0.184164 -0.167417 0.148386 0.150166 0.144014 0.139193 -0.107625 0.126026
qa: -0.4233 0.1324 -0.3433 -0.4035 0.2217 0.6507 -0.2465 -0.4032 -0.0954 -0.2136 -0.3809 -0.3512 -0.0303 0.0684 0.0235 0.0812 0.0877 0.1027 0.0945 0.1345 0.1426 0.1011 0.0983 0.1149 0.1052 0.0920 0.1010 0.2237 0.1605 0.1653 0.0558 0.1138 -0.2167 -0.2122 -0.1842 -0.1674 0.1484 0.1502 0.1440 0.1392 -0.1076 0.1260
va: 2.0289 3.3758 2.8689 3.0133 3.7850 3.5130 4.0031 3.9104 3.8358 3.9059 3.9327 3.8992 3.7187 4.0560 4.0691 1.0155 1.0092 1.0056 1.0139 1.0090 0.9948 1.0070 1.0071 0.9948 1.0024 0.9998 1.0117 1.0265 1.0108 0.9959 3.5259 3.8079 3.9500 3.9589 4.0287 4.0019 1.0040 0.9994 1.0077 1.0088 1.1983 0.9959
dispcorr: -0.026384251 hartree
energy: -1359.635129646213
dipole: 39.58063 -36.76539 2.81524 4.48821 -3.18263 1.30558 1.40532 -1.11118 0.29414
magnitude: 3.11715 au
magnitude: 7.92317 debye
