program: Orca
programVersion: 4.2.1
elementType: O N N N C C C C C C C C C C C H H H H H H H H H H H H H H H C C C C C C H H H H Cl H
charge: 0
multiplicity: 1
keywords: wb97x-d3
keywords: def2-TZVPP
keywords: def2/J RIJCOSX GRIDX6 NOFINALGRIDX
keywords: grid4 nofinalgrid
keywords: scfconv7
keywords: smallprint printgap noloewdin
keywords: NOSOSCF
formula: C17H20ClN3O
InChI: InChI=1/C17H20ClN3O/c1-16(2)8-7-14(9-13-3-5-15(18)6-4-13)17(16,22)10-21-12-19-11-20-21/h3-6,9,11-12,22H,7-8,10H2,1-2H3
42 atoms
O  1.309194 0.803657 -1.368184
N  0.710132 -1.899444 -0.444803
N  -0.271185 -1.568967 -1.294014
N  -1.045096 -2.953072 0.285008
C  3.533067 0.702933 -0.443247
C  2.072689 0.175292 -0.374333
C  4.109459 0.239108 0.898239
C  1.692973 0.450205 1.074093
C  2.961617 0.395717 1.901981
C  2.040141 -1.35607 -0.588936
C  3.512027 2.233828 -0.487074
C  4.331668 0.186773 -1.632657
C  0.502602 0.658377 1.638112
C  0.228068 -2.708567 0.495307
C  -1.301212 -2.217456 -0.809856
H  4.991149 0.816975 1.178422
H  4.431072 -0.803113 0.835032
H  3.066259 1.313607 2.483305
H  2.936012 -0.423463 2.623103
H  2.675826 -1.878278 0.123991
H  2.396122 -1.601457 -1.589485
H  4.52807 2.616493 -0.374868
H  3.124932 2.610714 -1.433488
H  2.910212 2.671876 0.311924
H  5.316097 0.658239 -1.652134
H  4.500351 -0.890408 -1.594769
H  3.842285 0.419862 -2.580125
H  0.485351 0.311616 -1.500289
H  0.834556 -3.107461 1.292938
H  -2.271377 -2.164656 -1.277466
C  -0.845478 0.734182 1.048516
C  -3.450851 0.805077 0.060024
C  -1.195561 1.601881 0.013628
C  -1.852031 -0.05396 1.6088
C  -3.146857 -0.03414 1.11904
C  -2.487206 1.634863 -0.489074
H  -0.458548 2.273537 -0.401499
H  -1.61662 -0.71121 2.436018
H  -3.904644 -0.668284 1.558435
H  -2.736685 2.311496 -1.295225
Cl -5.065861 0.834311 -0.570846
H  0.504706 0.742313 2.723454
elementType: O N C H Cl
totalener: -1359.61070723 hartree
nucrepener: 2036.07006201 hartree
electener: -3395.68076924 hartree
oneelecener: -5903.55561063 hartree
twoeener: 2507.87484138 hartree
cpcmener: -0.02755836 hartree
kineticenergy: 1355.00407427 hartree
xcener: -109.843286365571 hartree
chargesum: -0.0000000
charge: -0.446362 0.137136 -0.372814 -0.407553 0.246858 0.634533 -0.239810 -0.373248 -0.106986 -0.205220 -0.363272 -0.351771 -0.054147 0.055994 0.084249 0.081463 0.085800 0.104533 0.095074 0.130742 0.141630 0.099138 0.094248 0.102406 0.103868 0.091588 0.101012 0.222657 0.174099 0.156032 0.025512 0.110408 -0.235303 -0.188809 -0.173589 -0.144022 0.151508 0.131817 0.141023 0.144663 -0.107846 0.122762
qa: -0.4464 0.1371 -0.3728 -0.4076 0.2469 0.6345 -0.2398 -0.3732 -0.1070 -0.2052 -0.3633 -0.3518 -0.0541 0.0560 0.0842 0.0815 0.0858 0.1045 0.0951 0.1307 0.1416 0.0991 0.0942 0.1024 0.1039 0.0916 0.1010 0.2227 0.1741 0.1560 0.0255 0.1104 -0.2353 -0.1888 -0.1736 -0.1440 0.1515 0.1318 0.1410 0.1447 -0.1078 0.1228
va: 2.0034 3.3395 2.8441 2.9945 3.7233 3.5069 3.9844 3.9043 3.8658 3.9558 3.9465 3.9083 3.7245 4.0602 4.0142 1.0167 1.0110 1.0022 1.0103 0.9943 0.9919 1.0051 1.0146 0.9965 1.0024 0.9998 1.0122 1.0675 0.9940 0.9963 3.5444 3.7857 3.9196 3.9155 3.9720 3.9961 1.0249 1.0141 1.0079 1.0054 1.1977 1.0011
dispcorr: -0.027219215 hartree
energy: -1359.637926446793
dipole: 40.32212 -37.68312 2.63901 3.16268 -3.71410 -0.55142 2.49874 -1.38431 1.11442
magnitude: 2.91725 au
magnitude: 7.41506 debye
