program: Orca
programVersion: 4.2.1
elementType: O N N N C C C C C C C C C C C H H H H H H H H H H H H H H H C C C C C C H H H H Cl H
charge: 0
multiplicity: 1
keywords: wb97x-d3
keywords: def2-TZVPP
keywords: def2/J RIJCOSX GRIDX6 NOFINALGRIDX
keywords: grid4 nofinalgrid
keywords: scfconv7
keywords: smallprint printgap noloewdin
keywords: NOSOSCF
formula: C17H20ClN3O
InChI: InChI=1/C17H20ClN3O/c1-16(2)8-7-14(9-13-3-5-15(18)6-4-13)17(16,22)10-21-12-19-11-20-21/h3-6,9,11-12,22H,7-8,10H2,1-2H3
42 atoms
O  1.155721 0.699379 -1.319973
N  0.771003 -2.043698 -0.419689
N  0.422011 -2.629179 0.727201
N  -1.216001 -2.84214 -0.783505
C  3.420687 0.741495 -0.482164
C  1.996522 0.127318 -0.358198
C  4.07807 0.292044 0.831359
C  1.663527 0.391725 1.09873
C  2.955397 0.296957 1.880409
C  2.052571 -1.402059 -0.591181
C  3.312366 2.26865 -0.507092
C  4.201118 0.284221 -1.708745
C  0.495122 0.656867 1.678384
C  -0.216018 -2.179699 -1.312611
C  -0.773541 -3.09384 0.463391
H  4.906369 0.946858 1.105831
H  4.503338 -0.70845 0.723018
H  3.043075 1.14011 2.567166
H  2.978325 -0.604351 2.497243
H  2.750646 -1.89843 0.080077
H  2.381238 -1.597571 -1.611342
H  4.309961 2.709657 -0.461436
H  2.837706 2.629541 -1.419373
H  2.744713 2.666041 0.336923
H  5.159069 0.805749 -1.755885
H  4.428169 -0.782527 -1.695458
H  3.668713 0.504581 -2.636038
H  0.234503 0.503355 -1.120742
H  -0.15331 -1.805111 -2.32294
H  -1.346817 -3.637912 1.198151
C  -0.842596 0.797456 1.067136
C  -3.411747 1.053255 0.018094
C  -1.161835 1.843049 0.198626
C  -1.857914 -0.088663 1.428703
C  -3.134172 0.024381 0.904224
C  -2.436972 1.971902 -0.33286
H  -0.41294 2.581229 -0.05633
H  -1.647942 -0.885535 2.129838
H  -3.901525 -0.683492 1.187052
H  -2.66284 2.787247 -1.006851
Cl -5.005436 1.201998 -0.646404
H  0.502631 0.755388 2.762294
elementType: O N C H Cl
totalener: -1359.61672331 hartree
nucrepener: 2019.30403036 hartree
electener: -3378.92075368 hartree
oneelecener: -5869.78880481 hartree
twoeener: 2490.86805113 hartree
cpcmener: -0.02356129 hartree
kineticenergy: 1354.97683068 hartree
xcener: -109.832572274632 hartree
chargesum: -0.0000000
charge: -0.421158 0.127738 -0.332147 -0.389286 0.236203 0.622576 -0.247739 -0.349232 -0.111502 -0.231656 -0.360414 -0.355324 -0.036573 0.024761 0.031934 0.080840 0.086993 0.103829 0.094932 0.134064 0.143046 0.098725 0.096532 0.101751 0.104294 0.091101 0.105069 0.227702 0.180245 0.163919 -0.040419 0.119593 -0.197241 -0.188711 -0.156816 -0.171206 0.163272 0.145751 0.140129 0.143716 -0.100582 0.121290
qa: -0.4212 0.1277 -0.3321 -0.3893 0.2362 0.6226 -0.2477 -0.3492 -0.1115 -0.2317 -0.3604 -0.3553 -0.0366 0.0248 0.0319 0.0808 0.0870 0.1038 0.0949 0.1341 0.1430 0.0987 0.0965 0.1018 0.1043 0.0911 0.1051 0.2277 0.1802 0.1639 -0.0404 0.1196 -0.1972 -0.1887 -0.1568 -0.1712 0.1633 0.1458 0.1401 0.1437 -0.1006 0.1213
va: 2.0498 3.3687 2.8673 3.0231 3.7344 3.5523 3.9965 3.9138 3.8530 3.9600 3.9454 3.9095 3.7410 4.0599 4.0618 1.0167 1.0095 1.0046 1.0120 1.0080 0.9901 1.0060 1.0146 0.9979 1.0026 0.9998 1.0080 1.0424 0.9991 0.9958 3.5563 3.8187 3.9051 3.9435 3.9978 4.0375 1.0015 1.0064 1.0076 1.0076 1.2055 0.9997
dispcorr: -0.026543266 hartree
energy: -1359.643266580585
dipole: 38.96336 -36.84603 2.11733 3.34355 -2.97531 0.36824 1.25174 -0.90773 0.34402
magnitude: 2.17647 au
magnitude: 5.53215 debye
