program: Gaussian 09
title: 000007529
version: EM64L-G09RevD.01
frameworkgroup: C1[X(C9H10)]
method: RPBEPBE
basis: SDD
operation: Freq
keyword: #p
keyword: freq=noraman
keyword: PBEPBE/SDD
title: #p freq=noraman PBEPBE/SDD
converged: YES YES NO NO
title: Mulliken charges:
elementType: C C C C C C C C C H H H H H H H H H H
charge: 0.440505 0.476074 -0.550138 -0.402348 -0.395126 -0.217955 -0.807109 -0.197124 -0.576279 0.227966 0.231335 0.224577 0.222718 0.224088 0.235942 0.225208 0.212053 0.213934 0.211681
chargesum: 0.00000
title: Mulliken charges with hydrogens summed into heavy atoms:
elementType: C C C C C C C C C
charge: 0.440505 0.476074 -0.322172 -0.171013 -0.170549 0.004763 -0.121870 0.014928 -0.150665
polarizability: 1.52624948e+02 1.46189331e+00 9.93748895e+01 2.20718552e-01 -1.29518861e-01 4.38381717e+01
1716.lowfreq: -10.2520 -0.0005 0.0003 0.0005 3.0417 11.7222 38.1371 68.7452 201.2168
frequency: 37.2409 68.7327 201.2165 205.5096 210.1763 328.8393 428.8118 446.4071 488.9741 511.3206 572.0214 664.8752 718.2626 722.7354 808.4297 892.4870 897.6165 918.2900 929.5359 983.1098 987.7900 998.3850 1010.9329 1029.1113 1049.7759 1104.5421 1182.6831 1184.8586 1259.7125 1295.2982 1326.2211 1381.2333 1396.4347 1407.5591 1444.7579 1473.1610 1474.7363 1489.3268 1595.4562 1613.2042 1645.7323 2975.7348 3057.3885 3085.5846 3085.8242 3103.2956 3106.6741 3118.9324 3135.0937 3155.8730 3204.0882
redmass: 1.0236 2.4953 2.5900 3.0688 2.5202 2.7292 2.6630 4.0846 2.4025 4.5872 3.2462 2.2181 4.2317 1.4999 1.6639 1.4506 2.6095 1.5014 1.3481 1.3555 5.0550 1.5611 1.1636 1.5337 1.5742 1.5215 1.5212 1.0966 3.5966 1.4087 1.2388 6.4368 1.2269 2.0902 1.3879 1.2796 1.0585 2.0587 5.6022 5.9362 4.3988 1.0385 1.0952 1.0979 1.0825 1.0711 1.0910 1.0864 1.0912 1.0988 1.1140
irintensity: 0.5811 0.0693 5.9194 0.2055 0.4084 1.1242 6.7523 0.6193 0.1168 1.9921 1.2802 11.0196 1.3332 18.4522 38.9796 5.9335 4.1496 0.0639 86.2317 0.0502 0.4189 0.6115 20.5057 9.7460 20.5584 5.1945 4.0556 0.0626 4.8192 0.9186 2.3268 2.0537 12.7718 4.6193 3.5115 13.6107 13.1853 14.9892 10.5746 22.6507 13.7556 35.4527 23.5929 7.8281 27.7196 5.2165 23.9600 4.8957 21.3254 23.3620 24.2415
temp: 298.150 k
press: 1.00000 atm
elementType: 6 6 6 6 6 6 6 6 6 1 1 1 1 1 1 1 1 1 1
symmnumber: 1
zpe: 415187.9 jmol-1
zpe.correction: 0.158137 hartree
zpe.thermalcorrener: 0.166826 hartree
zpe.thermalcorrenthalpy: 0.167771 hartree
zpe.thermalcorrgfe: 0.123880 hartree
zpe.sumelectzpe: -348.293762 hartree
zpe.sumelectthermal: -348.285072 hartree
zpe.sumelectthermalent: -348.284128 hartree
zpe.sumelectthermalfe: -348.328019 hartree
dipole: 0.6478 -0.2136 0.0618
dipole: 0.6849
quadrupole: -47.6739 -47.5205 -59.5405
quadrupole: -0.5728 0.1252 -0.0246
quadrupole: 3.9044 4.0578 -7.9622 -0.5728 0.1252 -0.0246
hfenergy: -348.4518984 hartree
pointgroup: C01 [X(C9H10)]
dipole: -0.2515816 -0.0945807 -0.0190241 debye
dipolederiv: 0.3287636 0.2092842 0.0039395 0.255068 0.1039837 0.0042792 0.0565344 0.0360077 -0.0153829 0.1502127 -0.0125667 0.0019657 0.0011502 -0.0266244 0.0013326 -0.0050022 0.0000631 0.0743077 -0.2567282 -0.1112081 0.0022775 -0.012109 0.0692295 -0.0070573 -0.0074939 -0.0120567 -0.211298 -0.062896 -0.0726361 0.0065558 -0.1069312 -0.1176213 -0.0088204 0.0016475 -0.011406 -0.1920162 -0.0886714 0.0729895 -0.0076239 0.0907653 -0.0729265 -0.008415 -0.0061797 -0.005625 -0.1804206 -0.0377173 -0.0155475 -0.0019489 -0.0496464 0.1554291 -0.0085857 -0.005452 -0.0147044 -0.132772 -0.0659458 -0.1044889 -0.0050059 -0.1152632 -0.0041208 -0.0030366 -0.0844948 -0.0534337 0.0692367 0.3071383 -0.0478594 0.0001938 -0.2172818 0.2161297 -0.0149097 0.0074831 -0.0147505 -0.1455959 -0.3375118 -0.0014364 -0.0004354 -0.0465099 0.080988 -0.0233961 0.0022458 -0.0234584 -0.4139456 0.0832654 0.0311959 0.0019998 0.0187573 -0.1201356 0.0135819 0.0028709 0.0183482 0.1479611 -0.1091333 0.0819442 -0.0003022 0.0692556 0.0607609 0.0070607 0.0058376 0.004273 0.1547365 -0.0440113 -0.1115956 0.0070614 -0.0753956 0.0252389 0.0066843 0.00628 0.0072966 0.1501459 0.0717754 0.0202947 0.0006378 0.0336298 -0.1395249 0.013394 0.0017197 0.0134925 0.1529293 -0.0815905 0.0303322 0.0736003 0.1198145 0.020977 -0.0635958 0.098096 -0.0193672 0.070274 0.0174463 -0.0650657 -0.0390501 -0.0761364 0.0575021 -0.0502668 -0.0885422 -0.0778784 -0.0958867 0.0573115 0.054976 -0.0447132 -0.0260824 -0.0799939 0.1067645 0.0186008 0.1176451 0.0430705 0.0432675 -0.0530179 0.0032731 0.05515 -0.1380721 0.0133161 -0.0024651 0.0142326 0.1497556 -0.0775343 0.0811381 -0.0024049 0.0999872 0.0280891 0.0071068 -0.0030817 0.0068131 0.188502 0.1025592 0.0132674 -0.0000202 -0.018222 -0.1193085 0.0145637 0.0013956 0.0145085 0.1863988 unknown
polarizability: 152.6590389|0.5499764|99.2399636|-0.2675393|-2.3661208|43.9390069 unknown
InChI: InChI=1S/C9H10/c1-3-9-6-4-5-8(2)7-9/h3-7H,1H2,2H3
charge 0 multiplicity 1
19 atoms
C  -1.617188 -0.424674 0.004985
C  0.854884 -0.170759 -0.027222
C  -0.314045 -0.979246 0.024322
C  -1.744441 0.985736 -0.060783
C  0.694519 1.242091 -0.096839
C  -0.594161 1.809121 -0.112741
C  -2.845111 -1.319561 0.030055
C  2.176562 -0.835233 -0.002321
C  3.402663 -0.243543 -0.037715
H  -0.198852 -2.07045 0.081434
H  -2.742861 1.439724 -0.070078
H  1.574154 1.893937 -0.135155
H  -0.709396 2.89807 -0.161678
H  -3.713006 -0.802217 0.475337
H  -3.134516 -1.625978 -0.994098
H  -2.663133 -2.242214 0.609105
H  2.139782 -1.933928 0.050483
H  4.31882 -0.842513 -0.01443
H  3.533925 0.843538 -0.090161
