program: Gaussian 09
title: 000068753
version: EM64L-G09RevD.01
frameworkgroup: C1[X(C22H23N3O2)]
method: RPBEPBE
basis: SDD
operation: Freq
keyword: #p
keyword: freq=noraman
keyword: PBEPBE/SDD
title: #p freq=noraman PBEPBE/SDD
converged: YES YES NO NO
title: Mulliken charges:
elementType: O O N N N C C C C C C C C C C C C C C C C C C C C C C H H H H H H H H H H H H H H H H H H H H H H H
charge: -0.281098 -0.279201 -0.142815 -0.198645 -0.026666 -0.036756 -0.596170 -0.695680 0.500699 0.290204 -0.666712 -0.502065 -0.430903 -0.382853 -0.229779 -0.247338 0.222161 0.039436 -0.255070 -0.300314 -0.212934 0.358460 -0.377442 -0.355011 -0.240900 -0.232260 -0.239896 0.210661 0.203933 0.268548 0.207489 0.216007 0.270504 0.236576 0.256656 0.258010 0.264302 0.278221 0.231464 0.258256 0.223609 0.233755 0.227560 0.258759 0.238567 0.224087 0.259607 0.228010 0.233602 0.231360
chargesum: 0.00000
title: Mulliken charges with hydrogens summed into heavy atoms:
elementType: O O N N N C C C C C C C C C C C C C C C C C C C C C C
charge: -0.281098 -0.279201 -0.142815 -0.198645 -0.026666 0.173905 -0.123689 -0.001680 0.500699 0.290204 0.084531 0.040458 -0.199439 -0.124597 -0.006170 -0.013582 0.222161 0.039436 -0.027510 -0.041556 0.025633 0.358460 -0.153355 -0.095404 -0.012889 0.001342 -0.008536
polarizability: 3.24980532e+02 -2.23141985e+01 3.13179511e+02 -8.66488295e+00 -5.83832001e+00 1.68695043e+02
1716.lowfreq: -9.6630 -0.0004 0.0004 0.0006 3.1283 4.8894 14.9883 19.6045 30.9408
frequency: 14.4888 19.5515 30.8206 34.0093 54.0227 60.5223 67.5710 72.6054 90.5423 103.8838 113.6025 121.3793 148.7971 174.8709 196.8083 213.6094 217.9106 249.3047 275.3501 285.4073 287.0428 315.0011 338.2748 356.5250 390.9022 402.3508 409.9802 419.8312 431.3870 432.9184 460.4240 491.8751 507.7537 530.8738 559.6647 578.3532 590.2506 598.3697 602.4037 610.9163 617.9566 620.2466 697.6038 699.1271 712.4885 726.5527 741.4320 757.5693 778.1898 797.4203 810.5836 839.2555 850.1654 854.6684 865.4983 896.3189 904.3152 921.7990 924.6930 934.8787 943.3376 977.2732 982.3089 984.2617 988.9189 990.6794 998.7721 1004.0619 1020.0192 1027.9249 1034.7205 1051.8217 1077.2920 1085.2900 1085.5095 1098.8638 1110.0807 1115.6560 1132.5100 1146.0485 1171.1786 1173.7386 1177.8591 1187.5738 1190.3012 1195.1352 1209.5510 1219.2324 1270.8915 1281.2585 1298.3968 1310.9709 1316.1493 1318.8061 1324.6441 1332.2515 1341.5579 1380.5527 1381.2315 1381.6477 1400.8015 1405.1175 1421.2512 1433.0186 1439.4114 1453.5918 1461.7398 1473.0038 1474.8556 1484.4361 1484.7204 1489.1026 1491.3048 1493.1723 1564.7109 1587.1633 1590.2778 1603.1902 1612.4770 1613.2603 1646.4158 2971.8363 2987.2718 2998.5747 3001.8278 3018.9325 3052.0076 3078.8795 3080.9359 3089.6997 3110.3842 3112.1959 3116.6026 3120.6662 3126.1738 3133.0244 3134.5101 3142.0018 3146.9312 3153.7464 3159.7804 3162.8153 3177.3535 3184.5358
redmass: 5.0254 5.4595 4.6034 4.1765 4.4928 5.4194 3.8957 5.4441 4.3956 3.5147 1.5829 2.6766 4.6633 4.3237 3.5002 3.7004 1.1582 2.9954 4.9138 3.7492 6.4582 4.6782 2.9478 2.4695 4.7932 2.8352 2.9202 3.3629 4.7618 3.5842 3.5172 4.0037 3.2452 3.6897 4.0909 3.4160 5.3628 5.4519 5.3324 4.4833 6.2442 6.2355 1.8734 4.7556 2.0024 3.7362 4.3659 2.0081 2.0778 5.5714 3.3392 1.6817 1.2640 3.0049 1.2520 1.6962 2.9270 2.0463 1.5067 1.5175 2.7988 1.4439 1.3340 1.3854 5.3021 5.0439 1.3348 1.3124 2.8876 2.1890 1.7526 2.2570 2.8541 1.5756 1.5943 2.4495 1.4485 1.5529 2.1025 2.1198 1.0695 1.0574 2.2732 1.5664 1.1810 1.2653 1.9151 2.3673 3.2549 1.3287 1.5258 2.0318 1.4012 1.6706 1.5543 1.2850 1.6493 2.0242 5.8650 2.3204 2.4966 1.3940 1.8758 1.5197 2.1155 1.3214 1.0608 3.0200 1.2272 1.4865 1.5165 1.1095 2.0870 1.1714 6.7565 6.1296 5.9335 6.4752 6.0617 6.0466 8.3112 1.0392 1.0390 1.0810 1.0643 1.0577 1.0996 1.0989 1.0989 1.1037 1.0872 1.0995 1.0964 1.0860 1.0849 1.0914 1.0883 1.0959 1.0936 1.0893 1.1013 1.0978 1.0966 1.0977
irintensity: 0.3026 0.1649 0.1449 0.5759 1.1709 1.3652 2.1358 3.7268 1.0160 3.1875 1.7978 1.4505 4.0885 0.7391 2.5193 0.8317 0.3328 1.2724 1.8977 3.8616 0.6461 0.6264 8.1553 3.7783 7.5045 0.0544 0.1121 5.5231 2.7657 1.4716 6.5369 8.0885 9.3764 5.7218 22.5373 3.9317 15.5107 4.3585 12.3510 3.1330 0.5668 1.8452 37.3310 6.6748 44.3589 12.3838 22.3411 35.3579 48.0643 14.7067 2.6611 31.4963 2.6394 6.8230 0.0507 1.7642 26.3132 10.1473 7.5850 0.8261 13.5696 0.4285 0.1060 0.0081 0.2704 0.1064 0.1685 0.5322 16.2242 6.2205 9.5787 6.2710 5.9216 82.1505 2.3470 7.5656 26.2981 30.4308 7.3224 65.0012 0.5963 0.2735 23.8058 4.8230 1.4752 2.9266 10.5412 7.7911 12.5890 0.8059 79.0381 5.1386 10.5203 7.2887 6.2126 3.9903 123.6255 12.5038 3.4097 14.0959 6.1199 27.9504 28.0249 49.7840 15.4175 2.7389 11.2821 9.1219 21.6586 26.4516 2.5083 18.5586 35.3741 12.2182 145.8486 9.9898 7.7638 171.9681 2.7987 10.3981 212.7545 39.1926 28.8750 25.1223 41.3038 27.5753 24.5672 25.7854 12.0914 1.0029 8.4929 11.5174 21.4877 0.0640 4.1118 13.6125 5.0218 41.8082 24.6630 9.2738 23.1095 33.7924 5.4679 5.2264
temp: 298.150 k
press: 1.00000 atm
elementType: 8 8 7 7 7 6 6 6 6 6 6 6 6 6 6 6 6 6 6 6 6 6 6 6 6 6 6 1 1 1 1 1 1 1 1 1 1 1 1 1 1 1 1 1 1 1 1 1 1 1
symmnumber: 1
zpe: 1058772.3 jmol-1
zpe.correction: 0.403265 hartree
zpe.thermalcorrener: 0.427951 hartree
zpe.thermalcorrenthalpy: 0.428896 hartree
zpe.thermalcorrgfe: 0.345949 hartree
zpe.sumelectzpe: -1164.903131 hartree
zpe.sumelectthermal: -1164.878445 hartree
zpe.sumelectthermalent: -1164.877500 hartree
zpe.sumelectthermalfe: -1164.960448 hartree
dipole: 0.9808 2.8213 -1.8116
dipole: 3.4933
quadrupole: -119.8653 -169.8400 -160.7054
quadrupole: -2.3854 -4.7073 -0.6037
quadrupole: 30.2716 -19.7031 -10.5685 -2.3854 -4.7073 -0.6037
hfenergy: -1165.3063962 hartree
pointgroup: C01 [X(C22H23N3O2)]
dipole: -0.4640659 -1.120576 -0.64643 debye
polarizability: 322.0892386|-22.3718733|316.3304511|9.208954|-3.0350768|168.435397 unknown
InChI: InChI=1S/C22H23N3O2/c1-17(15-18-9-5-3-6-10-18)24(2)22(27)16-25-21(26)14-13-20(23-25)19-11-7-4-8-12-19/h3-14,17H,15-16H2,1-2H3
charge 0 multiplicity 1
50 atoms
O  -0.869761 1.727115 1.129274
O  1.103124 4.249322 -1.029832
N  -2.697683 1.572998 -0.311642
N  0.981486 1.902291 -0.875505
N  1.474591 0.656155 -0.590881
C  -3.645483 1.234736 0.80162
C  -3.248914 -0.083885 1.542654
C  -3.81603 2.416367 1.781832
C  -3.083802 -1.269627 0.605183
C  -1.352244 1.743537 -0.04581
C  -3.272353 1.584532 -1.671128
C  -0.427051 1.926762 -1.280303
C  -4.193926 -2.077086 0.24302
C  -1.816405 -1.57337 0.040686
C  -4.046219 -3.15404 -0.660978
C  -1.664077 -2.647347 -0.865583
C  1.675052 3.154011 -0.736094
C  2.747621 0.562882 -0.152969
C  -2.779494 -3.441563 -1.221353
C  3.042324 2.994119 -0.253989
C  3.558632 1.747117 0.029906
C  3.255686 -0.804623 0.136626
C  4.64883 -1.087371 0.122022
C  2.349932 -1.860925 0.429297
C  5.121878 -2.389272 0.394421
C  2.823424 -3.159905 0.700437
C  4.212667 -3.431621 0.685799
H  -4.614819 1.048844 0.298707
H  -4.052611 -0.283141 2.277478
H  -2.318159 0.107201 2.102478
H  -4.582487 2.171784 2.54029
H  -4.138495 3.327094 1.245906
H  -2.864031 2.628883 2.293807
H  -4.224186 2.145991 -1.664283
H  -3.474129 0.556074 -2.029201
H  -2.603915 2.084873 -2.386948
H  -0.591869 1.114824 -2.008031
H  -0.60362 2.908389 -1.754335
H  -5.178474 -1.867443 0.681308
H  -0.947388 -0.96446 0.317712
H  -4.9136 -3.77125 -0.922624
H  -0.676746 -2.8642 -1.2903
H  -2.662525 -4.277851 -1.919918
H  3.617939 3.912549 -0.111616
H  4.574266 1.648164 0.424205
H  5.370681 -0.301531 -0.127164
H  1.278653 -1.643173 0.45523
H  6.198681 -2.590303 0.37312
H  2.110579 -3.958615 0.933627
H  4.58075 -4.440911 0.900339
