program: Orca
programVersion: 4.2.1
elementType: O N N N C C C C C C C C C C C H H H H H H H H H H H H H H H C C C C C C H H H H Cl H
charge: 0
multiplicity: 1
keywords: wb97x-d3
keywords: def2-TZVPP
keywords: def2/J RIJCOSX GRIDX6 NOFINALGRIDX
keywords: grid4 nofinalgrid
keywords: scfconv7
keywords: smallprint printgap noloewdin
keywords: NOSOSCF
formula: C17H20ClN3O
InChI: InChI=1/C17H20ClN3O/c1-16(2)8-7-14(9-13-3-5-15(18)6-4-13)17(16,22)10-21-12-19-11-20-21/h3-6,9,11-12,22H,7-8,10H2,1-2H3
42 atoms
O  0.896082 0.44768 -1.287735
N  0.924843 -2.279937 -0.323491
N  0.895621 -2.947119 0.833526
N  -0.990517 -3.305465 -0.324411
C  3.23705 0.765214 -0.519631
C  1.868662 0.019945 -0.382644
C  3.980681 0.329288 0.757335
C  1.582802 0.228117 1.090066
C  2.890415 0.048466 1.813787
C  2.06078 -1.475766 -0.686948
C  2.992666 2.275945 -0.490987
C  4.000206 0.423875 -1.793668
C  0.465416 0.640357 1.680431
C  -0.209253 -2.499119 -1.000845
C  -0.269343 -3.54829 0.789762
H  4.682767 1.097161 1.085042
H  4.579286 -0.565019 0.570616
H  2.960093 0.710864 2.676769
H  2.964293 -0.972408 2.197032
H  2.919768 -1.891055 -0.164078
H  2.235903 -1.59549 -1.756773
H  2.453568 2.597184 0.402435
H  3.946679 2.805419 -0.500746
H  2.431034 2.608334 -1.365028
H  4.913208 1.018458 -1.856837
H  4.304113 -0.622858 -1.838064
H  3.405625 0.642888 -2.68225
H  0.400713 1.188707 -0.928167
H  -0.418644 -2.051684 -1.959213
H  -0.607179 -4.191744 1.587109
C  -0.846633 0.912461 1.048907
C  -3.320261 1.456223 -0.110663
C  -1.210728 2.217851 0.719464
C  -1.761601 -0.107933 0.811031
C  -2.991013 0.153899 0.229068
C  -2.437457 2.495463 0.13521
H  -0.523491 3.031572 0.918808
H  -1.515522 -1.123647 1.084403
H  -3.683269 -0.654617 0.039322
H  -2.70402 3.510648 -0.124401
Cl -4.848572 1.790683 -0.844131
H  0.51128 0.824168 2.751647
totalener: -1359.59302898 hartree
nucrepener: 2010.22490965 hartree
electener: -3369.81793863 hartree
oneelecener: -5851.31157424 hartree
twoeener: 2481.49363561 hartree
kineticenergy: 1354.99413493 hartree
xcener: -109.833569278920 hartree
chargesum: 0.0000000
charge: -0.375601 0.139282 -0.299058 -0.340385 0.233531 0.644502 -0.281146 -0.400278 -0.085104 -0.286998 -0.369989 -0.334891 0.009754 0.030046 0.040467 0.077622 0.083146 0.087483 0.100346 0.140806 0.127322 0.102701 0.092961 0.099300 0.098242 0.079110 0.109204 0.209457 0.146331 0.130668 0.007459 0.116261 -0.224287 -0.197168 -0.148951 -0.144580 0.136619 0.171002 0.129453 0.122414 -0.079810 0.102759
qa: -0.3756 0.1393 -0.2991 -0.3404 0.2335 0.6445 -0.2811 -0.4003 -0.0851 -0.2870 -0.3700 -0.3349 0.0098 0.0300 0.0405 0.0776 0.0831 0.0875 0.1003 0.1408 0.1273 0.1027 0.0930 0.0993 0.0982 0.0791 0.1092 0.2095 0.1463 0.1307 0.0075 0.1163 -0.2243 -0.1972 -0.1490 -0.1446 0.1366 0.1710 0.1295 0.1224 -0.0798 0.1028
va: 2.0919 3.3274 2.8426 3.0214 3.7385 3.4655 4.0201 3.8967 3.8163 3.9817 3.9377 3.9092 3.7342 4.0823 4.0471 1.0150 1.0112 1.0128 1.0230 1.0018 0.9992 0.9993 1.0109 1.0130 1.0065 1.0020 1.0092 1.0549 1.0139 1.0035 3.7042 3.8955 3.9498 3.9947 4.0379 4.0354 1.0059 0.9900 1.0159 1.0137 1.2265 1.0025
dispcorr: -0.026236498 hartree
energy: -1359.619265475643
dipole: 37.28175 -35.72506 1.55669 3.00061 -2.09955 0.90105 1.17104 -1.01134 0.15970
magnitude: 1.80573 au
magnitude: 4.58981 debye
