program: Orca
programVersion: 4.2.1
elementType: O N N N C C C C C C C C C C C H H H H H H H H H H H H H H H C C C C C C H H H H Cl H
charge: 0
multiplicity: 1
keywords: wb97x-d3
keywords: def2-TZVPP
keywords: def2/J RIJCOSX GRIDX6 NOFINALGRIDX
keywords: grid4 nofinalgrid
keywords: scfconv7
keywords: smallprint printgap noloewdin
keywords: NOSOSCF
formula: C17H20ClN3O
InChI: InChI=1/C17H20ClN3O/c1-16(2)8-7-14(9-13-3-5-15(18)6-4-13)17(16,22)10-21-12-19-11-20-21/h3-6,9,11-12,22H,7-8,10H2,1-2H3
42 atoms
O  1.299138 0.785042 -1.347584
N  0.714251 -1.916988 -0.419543
N  -0.265032 -1.56933 -1.262005
N  -1.042362 -2.990273 0.278536
C  3.521928 0.703446 -0.442939
C  2.063717 0.16598 -0.36331
C  4.113349 0.261532 0.899707
C  1.694527 0.44159 1.089597
C  2.969652 0.413447 1.910185
C  2.038771 -1.369241 -0.571764
C  3.480495 2.233944 -0.507153
C  4.314171 0.182604 -1.63556
C  0.505644 0.64861 1.654136
C  0.228852 -2.760748 0.49682
C  -1.300418 -2.232234 -0.803151
H  4.990636 0.85144 1.169229
H  4.453185 -0.776544 0.845735
H  3.067877 1.3414 2.476834
H  2.96356 -0.393455 2.646635
H  2.683992 -1.88138 0.141729
H  2.389881 -1.610785 -1.575907
H  4.493266 2.632625 -0.423931
H  3.061115 2.583562 -1.448884
H  2.886637 2.671312 0.297528
H  5.28722 0.674206 -1.683364
H  4.508423 -0.890059 -1.579748
H  3.796932 0.387701 -2.573846
H  0.502083 0.262463 -1.525517
H  0.83103 -3.182174 1.28695
H  -2.271843 -2.16033 -1.265314
C  -0.839287 0.728932 1.056975
C  -3.434857 0.842628 0.045889
C  -1.174197 1.631527 0.048528
C  -1.850549 -0.077578 1.576993
C  -3.139529 -0.036481 1.074204
C  -2.460396 1.686255 -0.462641
H  -0.422601 2.30395 -0.338206
H  -1.623484 -0.773291 2.374663
H  -3.903704 -0.687413 1.475581
H  -2.704614 2.388382 -1.247895
Cl -5.038447 0.89787 -0.599616
H  0.50838 0.750817 2.738318
totalener: -1359.59454345 hartree
nucrepener: 2036.36869890 hartree
electener: -3395.96324235 hartree
oneelecener: -5903.88058551 hartree
twoeener: 2507.91734316 hartree
kineticenergy: 1354.99877592 hartree
xcener: -109.839910863670 hartree
chargesum: -0.0000000
charge: -0.385757 0.138335 -0.338323 -0.329160 0.240769 0.633441 -0.247460 -0.338689 -0.133594 -0.244101 -0.340794 -0.343093 -0.056452 0.034784 0.081750 0.078294 0.074994 0.102157 0.087028 0.107384 0.136137 0.086454 0.107062 0.095755 0.096208 0.075580 0.113300 0.205601 0.135301 0.137910 0.048637 0.099601 -0.214526 -0.181876 -0.162367 -0.113635 0.138997 0.116182 0.122324 0.121436 -0.086535 0.100941
qa: -0.3858 0.1383 -0.3383 -0.3292 0.2408 0.6334 -0.2475 -0.3387 -0.1336 -0.2441 -0.3408 -0.3431 -0.0565 0.0348 0.0818 0.0783 0.0750 0.1022 0.0870 0.1074 0.1361 0.0865 0.1071 0.0958 0.0962 0.0756 0.1133 0.2056 0.1353 0.1379 0.0486 0.0996 -0.2145 -0.1819 -0.1624 -0.1136 0.1390 0.1162 0.1223 0.1214 -0.0865 0.1009
va: 2.0698 3.3198 2.8420 3.0250 3.7318 3.5149 3.9804 3.8525 3.8729 3.9875 3.9566 3.9125 3.7819 4.0816 4.0132 1.0217 1.0127 1.0032 1.0102 0.9970 0.9920 1.0061 1.0156 0.9997 1.0064 1.0002 1.0125 1.0888 1.0042 0.9996 3.5824 3.8776 3.9578 3.9394 3.9995 4.0114 1.0235 1.0170 1.0141 1.0126 1.2200 1.0050
dispcorr: -0.027232294 hartree
energy: -1359.621775741382
dipole: 40.16260 -38.36291 1.79970 2.99586 -3.24993 -0.25407 2.44668 -1.82832 0.61836
magnitude: 1.91985 au
magnitude: 4.87988 debye
