program: Orca
programVersion: 4.2.1
elementType: Cl Cl Cl Cl Cl Cl O O N N N N C C C C C C C C C C H H H H H H H H H H H H H H
charge: 0
multiplicity: 1
keywords: wb97x-d3
keywords: def2-TZVPP
keywords: def2/J RIJCOSX GRIDX6 NOFINALGRIDX
keywords: grid4 nofinalgrid
keywords: scfconv7
keywords: smallprint printgap noloewdin
keywords: NOSOSCF
formula: C10H14Cl6N4O2
InChI: InChI=1/C10H14Cl6N4O2/c11-9(12,13)7(17-5-21)19-1-2-20(4-3-19)8(18-6-22)10(14,15)16/h5-8,17-18H,1-4H2
36 atoms
Cl 5.230669 0.381829 1.0352
Cl 3.589956 1.796058 -0.847432
Cl 2.780094 1.603447 1.901455
Cl -3.621932 0.973301 -2.134143
Cl -5.406908 0.113475 -0.072311
Cl -3.299514 1.965125 0.547314
O  4.38095 -2.999201 0.251261
O  -3.928391 -3.193454 0.709006
N  1.393853 -0.590294 0.175277
N  -1.437163 -0.353551 0.115325
N  3.452699 -1.227201 -0.840722
N  -3.148087 -1.769513 -0.890397
C  -0.776221 -1.279941 1.026802
C  0.603949 -0.764642 1.380364
C  -0.650712 -0.222955 -1.101783
C  0.744879 0.283099 -0.781938
C  2.812545 -0.613558 0.293756
C  -2.828189 -0.659977 -0.025204
C  3.551854 0.736291 0.574542
C  -3.719249 0.552954 -0.41006
C  4.173674 -2.359224 -0.763765
C  -3.650476 -2.935927 -0.44832
H  -0.699835 -2.291675 0.602452
H  -1.355542 -1.35403 1.948615
H  -0.568915 -1.17603 -1.64394
H  -1.103015 0.500043 -1.776365
H  1.093804 -1.490831 2.030876
H  0.486062 0.161877 1.952072
H  0.67253 1.317202 -0.421634
H  1.2997 0.302947 -1.720134
H  3.044481 -1.232245 1.162111
H  -3.181937 -0.929455 0.971099
H  3.361201 -0.803102 -1.751469
H  -2.926468 -1.709665 -1.87343
H  4.575629 -2.652758 -1.741544
H  -3.784002 -3.657965 -1.264067
elementType: Cl O N C H
totalener: -3520.30332816 hartree
nucrepener: 2989.79936203 hartree
electener: -6510.10269019 hartree
twoeener: 4292.25075361 hartree
cpcmener: -0.04852194 hartree
kineticenergy: 3513.10221566 hartree
xcener: -198.307861643040 hartree
chargesum: 0.0000000
charge: -0.054016 -0.057121 -0.045036 -0.060342 -0.053797 -0.036319 -0.521740 -0.520356 -0.158113 -0.140551 -0.195412 -0.218363 -0.100441 -0.080290 -0.120301 -0.089631 -0.005623 0.011303 0.137546 0.127569 0.279260 0.281183 0.087038 0.096336 0.092133 0.106728 0.101262 0.086659 0.076493 0.097749 0.123403 0.125465 0.186704 0.191597 0.122771 0.126253
qa: -0.0540 -0.0571 -0.0450 -0.0603 -0.0538 -0.0363 -0.5217 -0.5204 -0.1581 -0.1406 -0.1954 -0.2184 -0.1004 -0.0803 -0.1203 -0.0896 -0.0056 0.0113 0.1375 0.1276 0.2793 0.2812 0.0870 0.0963 0.0921 0.1067 0.1013 0.0867 0.0765 0.0977 0.1234 0.1255 0.1867 0.1916 0.1228 0.1263
va: 1.2538 1.2474 1.2658 1.2444 1.2441 1.2711 1.9649 1.9600 2.9132 2.8611 3.1120 3.1085 3.9821 3.9145 3.9738 3.9662 4.0831 4.0446 4.4181 4.5038 4.1502 4.1391 1.0205 1.0091 1.0239 1.0238 1.0101 1.0182 1.0219 1.0028 1.0525 1.0547 1.0078 1.0039 0.9937 0.9937
dispcorr: -0.024412461 hartree
energy: -3520.327740622895
dipole: 1.96975 -1.84639 0.12336 -23.20239 24.02901 0.82662 -3.92336 0.88266 -3.04070
magnitude: 3.15347 au
magnitude: 8.01548 debye
