program: Orca
programVersion: 4.2.1
elementType: Cl Cl Cl Cl Cl Cl O O N N N N C C C C C C C C C C H H H H H H H H H H H H H H
charge: 0
multiplicity: 1
keywords: wb97x-d3
keywords: def2-TZVPP
keywords: def2/J RIJCOSX GRIDX6 NOFINALGRIDX
keywords: grid4 nofinalgrid
keywords: scfconv7
keywords: smallprint printgap noloewdin
keywords: NOSOSCF
formula: C10H14Cl6N4O2
InChI: InChI=1/C10H14Cl6N4O2/c11-9(12,13)7(17-5-21)19-1-2-20(4-3-19)8(18-6-22)10(14,15)16/h5-8,17-18H,1-4H2
36 atoms
Cl 3.770264 1.82336 1.824087
Cl 5.320593 -0.139222 0.407287
Cl 3.873835 1.8852 -1.051721
Cl -3.492602 1.462174 1.642513
Cl -3.616071 1.507815 -1.233505
Cl -5.349512 -0.241761 0.26072
O  2.108754 -2.892686 0.249634
O  -2.75481 -3.482054 0.18086
N  1.392046 0.638697 0.45204
N  -1.348943 -0.090935 0.263929
N  2.707116 -0.970841 -0.810862
N  -2.909172 -1.512507 -0.950504
C  -0.549342 -0.00942 -0.940937
C  0.601312 0.9659 -0.712523
C  -0.55741 -0.542531 1.397306
C  0.573921 0.446006 1.631508
C  2.596969 -0.110063 0.3361
C  -2.663838 -0.651367 0.170986
C  3.839409 0.826016 0.376732
C  -3.734174 0.471028 0.207057
C  2.475251 -2.306127 -0.736132
C  -2.93736 -2.866585 -0.836272
H  -1.146202 0.367537 -1.771863
H  -0.15583 -0.993399 -1.236196
H  -1.188956 -0.569487 2.287049
H  -0.155249 -1.554653 1.243131
H  0.18048 1.967147 -0.575246
H  1.225648 1.013451 -1.603146
H  1.198262 0.116292 2.462229
H  0.142572 1.410039 1.919886
H  2.702646 -0.748179 1.217515
H  -2.857165 -1.249717 1.064849
H  3.035768 -0.59006 -1.683388
H  -3.080783 -1.105381 -1.85528
H  2.658378 -2.805295 -1.702376
H  -3.151095 -3.347936 -1.805288
totalener: -3520.27673020 hartree
nucrepener: 3027.36418192 hartree
electener: -6547.64091212 hartree
twoeener: 4330.78119809 hartree
kineticenergy: 3513.16503861 hartree
xcener: -198.311262013430 hartree
chargesum: 0.0000000
charge: -0.032493 -0.041227 -0.062272 -0.035690 -0.065404 -0.038470 -0.364253 -0.361435 -0.147971 -0.132242 -0.219342 -0.225791 -0.130887 -0.101784 -0.138906 -0.051545 -0.037461 -0.002597 0.148797 0.146336 0.218997 0.233104 0.089765 0.083312 0.085664 0.129765 0.098225 0.070387 0.075653 0.091901 0.135504 0.130098 0.146991 0.144011 0.084684 0.076576
qa: -0.0325 -0.0412 -0.0623 -0.0357 -0.0654 -0.0385 -0.3643 -0.3614 -0.1480 -0.1322 -0.2193 -0.2258 -0.1309 -0.1018 -0.1389 -0.0515 -0.0375 -0.0026 0.1488 0.1463 0.2190 0.2331 0.0898 0.0833 0.0857 0.1298 0.0982 0.0704 0.0757 0.0919 0.1355 0.1301 0.1470 0.1440 0.0847 0.0766
va: 1.2744 1.2716 1.2603 1.2700 1.2550 1.2726 2.1232 2.1309 2.8417 2.7952 3.0318 3.0543 3.9023 4.0270 3.9087 3.9233 4.1158 4.0305 4.4673 4.4695 4.1931 4.2033 1.0193 1.0142 1.0203 1.0214 1.0173 1.0256 1.0199 1.0120 1.0322 1.0398 1.0438 1.0420 1.0033 1.0048
dispcorr: -0.026016975 hartree
energy: -3520.302747174953
dipole: -1.25149 1.45271 0.20122 -16.62672 17.44935 0.82263 -5.17841 3.51406 -1.66434
magnitude: 1.86742 au
magnitude: 4.74659 debye
