program: Orca
programVersion: 4.2.1
elementType: Cl Cl Cl Cl Cl Cl O O N N N N C C C C C C C C C C H H H H H H H H H H H H H H
charge: 0
multiplicity: 1
keywords: wb97x-d3
keywords: def2-TZVPP
keywords: def2/J RIJCOSX GRIDX6 NOFINALGRIDX
keywords: grid4 nofinalgrid
keywords: scfconv7
keywords: smallprint printgap noloewdin
keywords: NOSOSCF
formula: C10H14Cl6N4O2
InChI: InChI=1/C10H14Cl6N4O2/c11-9(12,13)7(17-5-21)19-1-2-20(4-3-19)8(18-6-22)10(14,15)16/h5-8,17-18H,1-4H2
36 atoms
Cl 3.914081 -1.313768 -1.367689
Cl 3.443617 1.525596 -1.314477
Cl 5.574588 0.398539 0.250336
Cl -3.531275 1.024991 1.657189
Cl -5.160033 -0.724806 0.049615
Cl -3.084218 -1.818196 1.710484
O  2.775849 -0.138908 3.653667
O  -2.460199 -0.411957 -3.3117
N  1.602417 -0.095892 0.38689
N  -1.179998 -0.281273 -0.000539
N  3.40023 -1.094628 1.688248
N  -2.933579 0.693951 -1.380994
C  -0.523024 1.009547 -0.002848
C  0.715864 0.945707 0.870116
C  -0.292692 -1.325756 -0.478118
C  0.948826 -1.387471 0.391287
C  2.95558 -0.01577 0.850122
C  -2.52417 -0.356825 -0.491468
C  3.930175 0.138777 -0.344965
C  -3.530402 -0.460639 0.682702
C  3.255877 -1.055219 3.036591
C  -2.857781 0.564883 -2.730087
H  -1.182857 1.77531 0.403716
H  -0.227549 1.320563 -1.016018
H  -0.805774 -2.286618 -0.414821
H  0.001907 -1.169893 -1.525652
H  0.421279 0.782798 1.916275
H  1.227699 1.907404 0.812869
H  1.608286 -2.152269 -0.017524
H  0.657727 -1.699023 1.405575
H  3.077444 0.903556 1.429551
H  -2.644194 -1.293442 -1.041903
H  3.763546 -1.933537 1.265537
H  -3.245452 1.571658 -0.998682
H  3.640148 -1.972015 3.513988
H  -3.212141 1.47341 -3.244815
totalener: -3520.28116111 hartree
nucrepener: 3015.08334970 hartree
electener: -6535.36451081 hartree
twoeener: 4318.44768763 hartree
kineticenergy: 3513.16763149 hartree
xcener: -198.309202106179 hartree
chargesum: 0.0000000
charge: -0.057219 -0.034226 -0.040786 -0.058896 -0.040699 -0.033579 -0.370756 -0.371249 -0.131175 -0.134651 -0.217414 -0.219944 -0.100575 -0.101731 -0.099104 -0.104362 -0.030607 -0.021211 0.145645 0.144136 0.230266 0.232667 0.086217 0.077762 0.081334 0.104624 0.106001 0.081257 0.086393 0.080498 0.130483 0.129634 0.146089 0.145629 0.079554 0.079996
qa: -0.0572 -0.0342 -0.0408 -0.0589 -0.0407 -0.0336 -0.3708 -0.3712 -0.1312 -0.1347 -0.2174 -0.2199 -0.1006 -0.1017 -0.0991 -0.1044 -0.0306 -0.0212 0.1456 0.1441 0.2303 0.2327 0.0862 0.0778 0.0813 0.1046 0.1060 0.0813 0.0864 0.0805 0.1305 0.1296 0.1461 0.1456 0.0796 0.0800
va: 1.2631 1.2695 1.2695 1.2602 1.2691 1.2707 2.1238 2.1220 2.8082 2.8147 3.0635 3.0621 3.9474 3.9667 3.9644 3.9536 4.0887 4.0700 4.4714 4.4744 4.2015 4.2002 1.0169 1.0228 1.0160 1.0255 1.0266 1.0161 1.0156 1.0210 1.0269 1.0322 1.0441 1.0428 1.0042 1.0044
dispcorr: -0.025255732 hartree
energy: -3520.306416841323
dipole: 0.32490 -0.21690 0.10800 -0.47427 0.52833 0.05406 0.14662 -0.16814 -0.02152
magnitude: 0.12268 au
magnitude: 0.31182 debye
