program: Orca
programVersion: 4.2.1
elementType: Cl F F F O N N N C C C C C C C C C C C C C C C H H H H H H H H H H H H H H H
charge: 0
multiplicity: 1
keywords: wb97x-d3
keywords: def2-TZVPP
keywords: def2/J RIJCOSX GRIDX6 NOFINALGRIDX
keywords: grid4 nofinalgrid
keywords: scfconv7
keywords: smallprint printgap noloewdin
keywords: NOSOSCF
formula: C15H15ClF3N3O
InChI: InChI=1/C15H15ClF3N3O/c1-2-7-23-9-14(22-6-5-20-10-22)21-13-4-3-11(16)8-12(13)15(17,18)19/h3-6,8,10H,2,7,9H2,1H3
38 atoms
Cl -4.392703 2.16662 -0.233632
F  -1.895014 -1.720292 2.034011
F  -0.792232 -2.670007 0.456967
F  0.173386 -1.233198 1.730149
O  1.201461 1.480154 0.293643
N  2.791105 -1.444813 -1.126333
N  0.618259 -0.796792 -1.185855
N  4.777109 -2.402351 -1.245831
C  1.776563 -0.556997 -0.750148
C  2.23172 0.562879 0.150773
C  1.259916 2.253587 1.47462
C  -0.528607 -0.065237 -0.911593
C  0.01631 3.11259 1.554185
C  -1.370597 -0.406761 0.152177
C  -0.934217 0.940656 -1.786248
C  -2.558299 0.283892 0.36054
C  2.643114 -2.557628 -1.929485
C  0.032368 3.993523 2.793719
C  4.105224 -1.412136 -0.746217
C  -0.976139 -1.503872 1.088261
C  -2.112157 1.629963 -1.581797
C  -2.916571 1.301478 -0.50169
C  3.871274 -3.1234 -1.989289
H  3.127813 1.02825 -0.279475
H  2.537879 0.121261 1.109505
H  2.158518 2.884945 1.477113
H  1.3254 1.599325 2.354279
H  -0.054908 3.733809 0.658003
H  -0.866753 2.468446 1.561296
H  -0.30505 1.194096 -2.628495
H  -3.204706 0.036202 1.19055
H  1.701983 -2.830905 -2.371004
H  0.086236 3.399029 3.707378
H  0.886963 4.672382 2.791096
H  -0.869047 4.603134 2.853002
H  4.516106 -0.649108 -0.105553
H  -2.397721 2.42077 -2.261912
H  4.160581 -4.012138 -2.526054
elementType: Cl F O N C H
totalener: -1579.96605001 hartree
nucrepener: 2199.25704254 hartree
electener: -3779.22309255 hartree
oneelecener: -6540.65808091 hartree
twoeener: 2761.43498836 hartree
cpcmener: -0.02731079 hartree
kineticenergy: 1574.92883288 hartree
xcener: -123.753509331107 hartree
chargesum: 0.0000000
charge: -0.099415 -0.179848 -0.179202 -0.182862 -0.336026 -0.036290 -0.331058 -0.383046 0.264562 -0.020960 0.016835 0.223920 -0.073374 -0.183239 -0.221497 -0.102509 -0.119124 -0.277105 0.066169 0.564393 -0.111491 0.081185 -0.119801 0.133728 0.125014 0.089484 0.077706 0.060150 0.058256 0.145195 0.128331 0.182235 0.081879 0.084375 0.092775 0.165283 0.145360 0.170007
qa: -0.0994 -0.1798 -0.1792 -0.1829 -0.3360 -0.0363 -0.3311 -0.3830 0.2646 -0.0210 0.0168 0.2239 -0.0734 -0.1832 -0.2215 -0.1025 -0.1191 -0.2771 0.0662 0.5644 -0.1115 0.0812 -0.1198 0.1337 0.1250 0.0895 0.0777 0.0602 0.0583 0.1452 0.1283 0.1822 0.0819 0.0844 0.0928 0.1653 0.1454 0.1700
va: 1.2030 1.1231 1.1175 1.1057 1.9563 3.3441 3.0377 3.1111 3.8571 3.9843 3.9041 3.8350 3.8963 3.8040 4.0442 3.9362 3.8968 3.9662 4.0575 4.4114 3.9642 3.7977 4.0352 0.9907 0.9850 0.9910 0.9967 1.0108 1.0066 1.0029 1.0274 1.0069 1.0008 1.0021 1.0030 0.9953 1.0018 0.9988
dispcorr: -0.020297368 hartree
energy: -1579.986347382878
dipole: 20.36229 -19.93147 0.43082 21.60580 -19.70500 1.90080 3.36880 -3.08119 0.28760
magnitude: 1.97012 au
magnitude: 5.00764 debye
