program: Gaussian 09
title: 000073715
version: EM64L-G09RevD.01
frameworkgroup: C1[X(C6H12N2O2)]
method: RPBEPBE
basis: SDD
operation: Freq
keyword: #p
keyword: freq=noraman
keyword: PBEPBE/SDD
title: #p freq=noraman PBEPBE/SDD
converged: YES YES NO NO
title: Mulliken charges:
elementType: O O N N C C C C C C H H H H H H H H H H H H
charge: -0.306795 -0.306811 -0.322994 -0.322981 -0.480393 -0.480343 0.285378 0.285341 -0.661157 -0.661149 0.239571 0.209740 0.239535 0.209703 0.348320 0.348330 0.251593 0.218666 0.218084 0.218664 0.218117 0.251580
chargesum: 0.00000
title: Mulliken charges with hydrogens summed into heavy atoms:
elementType: O O N N C C C C C C
charge: -0.306795 -0.306811 0.025326 0.025349 -0.031081 -0.031105 0.285378 0.285341 0.027187 0.027211
polarizability: 1.33038170e+02 -5.06319486e+00 8.31223154e+01 1.07118273e-03 7.94838434e-03 5.98563557e+01
1716.lowfreq: -3.6461 -0.0007 -0.0007 -0.0006 1.9138 11.2871 30.4091 42.3744 86.0429
frequency: 30.4002 42.3043 86.0421 91.2172 100.5257 207.0055 207.3919 231.9524 239.7426 281.8469 318.3077 344.9882 468.3186 556.7096 571.0087 613.9024 620.3858 691.5571 695.5495 791.4023 795.6790 850.1998 949.8798 1012.6130 1013.7907 1050.9051 1069.8443 1074.2225 1077.2616 1146.4040 1184.4079 1229.6297 1261.4695 1277.1080 1321.0943 1338.6238 1389.1404 1390.6846 1418.8755 1453.0726 1453.3986 1474.4075 1474.4473 1488.6649 1488.7739 1523.5243 1560.5499 1613.2663 2990.3467 2990.4579 2995.0993 2995.3388 3044.9701 3045.1146 3092.0783 3092.2009 3106.0236 3106.0538 3499.3502 3511.1586
redmass: 2.7670 3.0498 4.7605 3.5798 3.2031 1.2390 1.4271 2.0509 3.2863 4.5180 3.1665 4.4087 3.1294 3.1251 2.1896 1.0886 2.0819 3.8033 2.3704 1.2620 1.2855 4.0305 2.7103 3.0891 2.2158 1.7230 1.7621 1.9168 1.6880 3.1015 1.4747 1.6399 1.1621 1.3934 1.4018 1.6717 1.2218 1.1932 3.0278 1.1004 1.1246 1.0442 1.0476 1.0564 1.0683 2.3502 7.8199 6.3820 1.0579 1.0578 1.0370 1.0371 1.1012 1.1012 1.1009 1.1008 1.1008 1.1008 1.0800 1.0797
irintensity: 0.2330 0.0804 14.8345 0.2709 12.7597 0.0581 0.4679 22.9774 4.3706 2.3452 0.5969 8.9041 15.9503 18.6612 0.2030 209.0207 0.3800 1.5958 0.0465 13.1690 5.4182 12.0897 0.0740 0.0872 5.9320 0.1615 30.7249 0.3549 16.6938 0.0398 28.0514 0.2992 8.6288 1.8969 55.3756 1.7645 8.8431 9.8751 581.0639 9.7890 23.7375 10.8553 19.5819 3.9582 45.3182 0.0312 449.0097 0.4250 24.4256 24.6203 41.0613 15.2355 9.4596 18.1884 46.0469 31.0732 8.3892 37.9857 0.0077 181.6331
temp: 298.150 k
press: 1.00000 atm
elementType: 8 8 7 7 6 6 6 6 6 6 1 1 1 1 1 1 1 1 1 1 1 1
symmnumber: 1
zpe: 478749.6 jmol-1
zpe.correction: 0.182346 hartree
zpe.thermalcorrener: 0.194236 hartree
zpe.thermalcorrenthalpy: 0.195180 hartree
zpe.thermalcorrgfe: 0.143133 hartree
zpe.sumelectzpe: -494.992811 hartree
zpe.sumelectthermal: -494.980922 hartree
zpe.sumelectthermalent: -494.979978 hartree
zpe.sumelectthermalfe: -495.032024 hartree
dipole: -0.0002 -0.0003 0.0275
dipole: 0.0275
quadrupole: -54.4138 -67.1893 -60.6318
quadrupole: 14.2626 0.0058 -0.0006
quadrupole: 6.3312 -6.4443 0.1132 14.2626 0.0058 -0.0006
hfenergy: -495.1751573 hartree
pointgroup: C01 [X(C6H12N2O2)]
dipole: 0.0000946 0.0000948 0.01081 debye
dipolederiv: -0.7116007 -0.0777219 0.0123885 0.5043112 -0.9921672 0.0183258 0.0027956 0.0063291 -0.3810843 -0.7115571 -0.0776533 -0.0124059 0.5041452 -0.9921533 -0.0202389 -0.0017773 -0.0075356 -0.3811903 -1.0001934 0.3313758 0.00063 0.5011171 -0.3968471 0.0081552 -0.0040417 -0.0038452 -0.2744182 -0.99977 0.3314586 0.000356 0.5012242 -0.3969286 -0.0087313 0.005576 0.0032886 -0.2744146 -0.2043313 -0.1255278 0.0516538 -0.0880385 0.0135562 -0.035849 0.0113687 -0.0496026 0.072613 -0.204421 -0.1255717 -0.0519368 -0.0878113 0.0136638 0.0354777 -0.0125071 0.0490998 0.0724556 1.5626563 -0.242689 -0.00428 -0.7597319 1.1649761 -0.0290178 0.0700112 0.0112023 0.1665977 1.562516 -0.2427274 0.0032005 -0.7595525 1.1650213 0.0320503 -0.0717094 -0.0087208 0.1665469 0.0487627 0.0338049 0.0343531 -0.0631819 0.0093918 -0.0122165 -0.023424 -0.0227921 0.0608567 0.0487877 0.0337709 -0.034257 -0.063398 0.0093781 0.0121687 0.0236393 0.0228434 0.060887 0.0034287 -0.010792 -0.0555638 -0.0209665 0.0834163 0.0327423 -0.0480603 0.0020351 -0.0974512 -0.0042245 0.0989411 0.0152795 0.0476408 -0.1378298 0.0003384 0.0276543 0.02782 0.0845843 0.0035035 -0.0107813 0.0557991 -0.0208999 0.0834285 -0.0326973 0.0483174 -0.0019259 -0.097304 -0.0041636 0.0989274 -0.015326 0.0475742 -0.1378769 -0.000351 -0.0276429 -0.0278666 0.0845295 0.2802547 0.046376 -0.0027054 -0.1154773 0.2145449 0.0025093 0.001567 0.001377 0.3426927 0.280243 0.0463879 0.0029111 -0.1154634 0.2145583 -0.0027024 -0.0017172 -0.0016702 0.3426747 0.1191122 0.0336467 0.0056323 0.098031 -0.0823682 0.0032897 -0.0061149 0.029292 0.0858906 0.0555182 0.027 -0.092316 0.0300632 0.0931114 0.0307538 -0.0256501 0.0255686 -0.1381332 -0.1494342 -0.1144193 0.011463 -0.1338522 0.0302217 -0.017644 0.0039259 -0.0272526 0.0778931 0.0553732 0.0269532 0.0925725 0.0300584 0.0931506 -0.0305392 0.0259514 -0.0253241 -0.1379914 -0.1494275 -0.1144845 -0.0117864 -0.1338301 0.0301305 0.0174706 -0.0044042 0.0270632 0.0779247 0.1189673 0.0337257 -0.0056619 0.0980383 -0.0823782 -0.0032943 0.0062423 -0.0293832 0.0858407 unknown
polarizability: 133.2095498|-4.129372|82.9508958|-0.0190993|0.0305521|59.8563958 unknown
InChI: InChI=1S/C6H12N2O2/c1-3-5(9)7-8-6(10)4-2/h7-8H,3-4H2,1-2H3
charge 0 multiplicity 1
22 atoms
O  -1.864888 1.513236 -0.350152
O  1.865325 -1.51313 -0.35477
N  -0.580544 -0.393071 -0.352327
N  0.581017 0.393228 -0.351963
C  -3.02511 -0.676712 -0.392341
C  3.025587 0.676798 -0.392584
C  -1.807814 0.238942 -0.359866
C  1.808258 -0.238802 -0.361883
C  -4.077316 -0.259907 0.661446
C  4.076525 0.259431 0.662313
H  -3.471386 -0.597962 -1.402884
H  -2.724099 -1.732254 -0.252136
H  3.473056 0.598304 -1.402597
H  2.72457 1.732323 -0.252276
H  -0.386909 -1.4002 -0.352338
H  0.387406 1.400355 -0.349667
H  -4.328168 0.807184 0.539999
H  -3.695841 -0.407001 1.687397
H  -4.998842 -0.856928 0.545748
H  3.693688 0.405687 1.687876
H  4.998049 0.856773 0.548241
H  4.327837 -0.807496 0.540364
