program: Orca
programVersion: 4.2.1
elementType: Cl F F F O N N N C C C C C C C C C C C C C C C H H H H H H H H H H H H H H H
charge: 0
multiplicity: 1
keywords: wb97x-d3
keywords: def2-TZVPP
keywords: def2/J RIJCOSX GRIDX6 NOFINALGRIDX
keywords: grid4 nofinalgrid
keywords: scfconv7
keywords: smallprint printgap noloewdin
keywords: NOSOSCF
formula: C15H15ClF3N3O
InChI: InChI=1/C15H15ClF3N3O/c1-2-7-23-9-14(22-6-5-20-10-22)21-13-4-3-11(16)8-12(13)15(17,18)19/h3-6,8,10H,2,7,9H2,1H3
38 atoms
Cl -4.968626 1.599777 -0.534652
F  -0.854647 -2.676575 0.45281
F  -0.067932 -1.149319 1.746437
F  -2.087539 -1.831125 1.991536
O  2.676446 1.833937 0.288553
N  2.743259 -0.647395 -1.149744
N  0.482793 -0.588082 -1.028273
N  4.861421 -1.103685 -1.569392
C  1.560351 0.072487 -0.960689
C  1.713675 1.553902 -0.689717
C  2.366178 1.378796 1.597486
C  -0.772905 -0.01688 -0.883721
C  1.211786 2.110726 2.260542
C  -1.635567 -0.480375 0.118752
C  -1.24747 0.934109 -1.784439
C  -2.921386 0.027198 0.230043
C  2.852349 -2.024103 -1.167729
C  1.055727 1.670198 3.708724
C  3.995421 -0.153564 -1.397336
C  -1.162883 -1.533242 1.074638
C  -2.533339 1.434573 -1.684919
C  -3.360381 0.981101 -0.67231
C  4.157392 -2.27703 -1.421002
H  0.734888 1.971142 -0.440371
H  2.034182 2.047797 -1.610806
H  3.278209 1.535374 2.176059
H  2.177519 0.297622 1.602569
H  1.395281 3.187065 2.217311
H  0.273535 1.92865 1.729524
H  -0.607626 1.274151 -2.588237
H  -3.587717 -0.314056 1.009373
H  2.011859 -2.670015 -0.98759
H  1.960945 1.867788 4.285138
H  0.235991 2.201134 4.191779
H  0.843034 0.602852 3.783858
H  4.213513 0.898233 -1.463599
H  -2.879585 2.171521 -2.39621
H  4.63569 -3.239286 -1.502454
elementType: Cl F O N C H
totalener: -1579.96752567 hartree
nucrepener: 2185.50087697 hartree
electener: -3765.46840264 hartree
oneelecener: -6512.53194060 hartree
twoeener: 2747.06353796 hartree
cpcmener: -0.02705467 hartree
kineticenergy: 1574.91859318 hartree
xcener: -123.750164827569 hartree
chargesum: -0.0000000
charge: -0.087467 -0.175760 -0.177482 -0.179536 -0.391256 -0.026909 -0.300793 -0.385444 0.192482 -0.005667 0.020076 0.131694 -0.100635 -0.186253 -0.182207 -0.074674 -0.129235 -0.274381 0.074346 0.562314 -0.111844 0.084836 -0.119294 0.132685 0.161628 0.114927 0.075569 0.075982 0.058687 0.165520 0.133039 0.181723 0.086830 0.095794 0.079446 0.161489 0.150195 0.169575
qa: -0.0875 -0.1758 -0.1775 -0.1795 -0.3913 -0.0269 -0.3008 -0.3854 0.1925 -0.0057 0.0201 0.1317 -0.1006 -0.1863 -0.1822 -0.0747 -0.1292 -0.2744 0.0743 0.5623 -0.1118 0.0848 -0.1193 0.1327 0.1616 0.1149 0.0756 0.0760 0.0587 0.1655 0.1330 0.1817 0.0868 0.0958 0.0794 0.1615 0.1502 0.1696
va: 1.2161 1.1223 1.1114 1.1233 1.9198 3.3241 2.9972 3.1141 3.8326 3.9338 3.8882 3.8701 3.8662 3.8237 3.9506 3.9715 3.9101 3.9414 4.0446 4.4019 3.9890 3.8615 4.0458 0.9862 0.9820 0.9952 0.9992 1.0167 1.0097 0.9904 1.0239 1.0043 1.0022 1.0020 1.0078 1.0064 1.0010 0.9995
dispcorr: -0.020467972 hartree
energy: -1579.987993645342
dipole: 25.14083 -26.33051 -1.18969 15.90608 -14.28801 1.61807 6.12534 -6.32260 -0.19726
magnitude: 2.01802 au
magnitude: 5.12940 debye
