program: Orca
programVersion: 4.2.1
elementType: Cl F F F O N N N C C C C C C C C C C C C C C C H H H H H H H H H H H H H H H
charge: 0
multiplicity: 1
keywords: wb97x-d3
keywords: def2-TZVPP
keywords: def2/J RIJCOSX GRIDX6 NOFINALGRIDX
keywords: grid4 nofinalgrid
keywords: scfconv7
keywords: smallprint printgap noloewdin
keywords: NOSOSCF
formula: C15H15ClF3N3O
InChI: InChI=1/C15H15ClF3N3O/c1-2-7-23-9-14(22-6-5-20-10-22)21-13-4-3-11(16)8-12(13)15(17,18)19/h3-6,8,10H,2,7,9H2,1H3
38 atoms
Cl -5.236946 1.286217 -0.356702
F  -1.903684 -1.576707 2.338297
F  -0.798062 -2.646468 0.84081
F  0.017763 -0.85515 1.705799
O  2.217474 1.161599 0.631136
N  2.44875 -0.901667 -1.235206
N  0.177356 -0.886391 -1.227585
N  3.829159 -2.570269 -1.655905
C  1.241623 -0.246912 -0.985886
C  1.347228 1.159013 -0.463394
C  2.348281 2.443317 1.215377
C  -1.077765 -0.334891 -0.985294
C  3.312754 2.365319 2.378526
C  -1.771623 -0.600465 0.200583
C  -1.69805 0.429237 -1.969495
C  -3.05141 -0.097926 0.392488
C  3.701102 -0.342793 -1.399411
C  3.460664 3.715959 3.062356
C  2.598274 -2.250651 -1.403323
C  -1.118283 -1.420346 1.270231
C  -2.973334 0.930521 -1.783185
C  -3.641975 0.663144 -0.600333
C  4.525676 -1.383177 -1.665354
H  0.349534 1.519249 -0.190351
H  1.699294 1.81167 -1.276135
H  1.368767 2.802807 1.559582
H  2.710178 3.165268 0.470404
H  2.955949 1.624062 3.098107
H  4.286986 2.021706 2.021615
H  -1.174709 0.628389 -2.89492
H  -3.591437 -0.290596 1.308582
H  3.893692 0.713319 -1.339373
H  4.159842 3.657415 3.896126
H  3.834617 4.474997 2.373148
H  2.507205 4.070066 3.458265
H  1.77153 -2.934515 -1.306531
H  -3.435318 1.526288 -2.558268
H  5.584719 -1.346881 -1.862235
elementType: Cl F O N C H
totalener: -1579.96793197 hartree
nucrepener: 2138.93341347 hartree
electener: -3718.90134544 hartree
oneelecener: -6419.92049135 hartree
twoeener: 2701.01914590 hartree
cpcmener: -0.02974662 hartree
kineticenergy: 1574.92304931 hartree
xcener: -123.746412188807 hartree
chargesum: -0.0000000
charge: -0.089511 -0.177314 -0.177156 -0.176977 -0.354973 -0.020025 -0.297932 -0.386570 0.217317 0.002428 0.039744 0.059547 -0.080103 -0.155582 -0.163407 -0.086336 -0.121135 -0.279313 0.072054 0.565703 -0.109397 0.084335 -0.126341 0.126339 0.151596 0.077682 0.076872 0.059971 0.061800 0.153217 0.133325 0.178278 0.094958 0.081279 0.081686 0.163745 0.149934 0.170262
qa: -0.0895 -0.1773 -0.1772 -0.1770 -0.3550 -0.0200 -0.2979 -0.3866 0.2173 0.0024 0.0397 0.0595 -0.0801 -0.1556 -0.1634 -0.0863 -0.1211 -0.2793 0.0721 0.5657 -0.1094 0.0843 -0.1263 0.1263 0.1516 0.0777 0.0769 0.0600 0.0618 0.1532 0.1333 0.1783 0.0950 0.0813 0.0817 0.1637 0.1499 0.1703
va: 1.2135 1.1264 1.1208 1.1184 1.9448 3.3125 3.0208 3.1138 3.9421 3.9570 3.8894 4.0039 3.9041 3.8389 3.9931 3.9839 3.9338 3.9575 4.0221 4.4097 3.9830 3.8477 4.0305 0.9990 0.9847 0.9924 0.9925 1.0118 1.0094 1.0011 1.0247 0.9937 1.0027 1.0014 1.0013 1.0124 1.0007 0.9991
dispcorr: -0.017972932 hartree
energy: -1579.985904905495
dipole: 34.75717 -35.07806 -0.32090 25.23451 -21.92082 3.31369 2.09157 -2.60514 -0.51357
magnitude: 3.36857 au
magnitude: 8.56223 debye
