program: Orca
programVersion: 4.2.1
elementType: Cl F F F O N N N C C C C C C C C C C C C C C C H H H H H H H H H H H H H H H
charge: 0
multiplicity: 1
keywords: wb97x-d3
keywords: def2-TZVPP
keywords: def2/J RIJCOSX GRIDX6 NOFINALGRIDX
keywords: grid4 nofinalgrid
keywords: scfconv7
keywords: smallprint printgap noloewdin
keywords: NOSOSCF
formula: C15H15ClF3N3O
InChI: InChI=1/C15H15ClF3N3O/c1-2-7-23-9-14(22-6-5-20-10-22)21-13-4-3-11(16)8-12(13)15(17,18)19/h3-6,8,10H,2,7,9H2,1H3
38 atoms
Cl -5.257005 0.974638 0.753872
F  -0.588672 -1.960044 -1.760405
F  -1.756908 -0.453334 -2.746345
F  0.111835 0.071832 -1.82692
O  2.23403 1.458828 -0.024652
N  2.504575 -1.142485 0.944839
N  0.236536 -1.168522 0.866016
N  4.656318 -1.547924 1.21755
C  1.284966 -0.464768 0.928567
C  1.36274 1.036727 0.982427
C  2.360287 2.865706 -0.094465
C  -1.032716 -0.600128 0.821696
C  3.267947 3.219502 -1.251276
C  -1.694155 -0.392053 -0.394177
C  -1.704042 -0.315978 2.00747
C  -2.993229 0.097217 -0.411904
C  2.692877 -2.477664 0.646672
C  2.732759 2.770576 -2.602713
C  3.732051 -0.640864 1.281854
C  -0.985804 -0.685108 -1.681103
C  -2.998362 0.170587 1.994305
C  -3.635082 0.374358 0.781615
C  4.017382 -2.69883 0.814211
H  1.701862 1.340922 1.984012
H  0.358401 1.455864 0.856863
H  2.770095 3.256598 0.845921
H  1.3735 3.327874 -0.233633
H  3.393423 4.304673 -1.244126
H  4.260663 2.796397 -1.07673
H  -1.206274 -0.486623 2.952455
H  -3.508898 0.267147 -1.346256
H  1.88746 -3.118795 0.336114
H  2.627756 1.687559 -2.659787
H  1.753921 3.209075 -2.804802
H  3.401714 3.077854 -3.406717
H  3.889884 0.380501 1.584151
H  -3.500683 0.386774 2.92688
H  4.55341 -3.621835 0.66398
elementType: Cl F O N C H
totalener: -1579.96794893 hartree
nucrepener: 2163.15999884 hartree
electener: -3743.12794777 hartree
oneelecener: -6468.46563789 hartree
twoeener: 2725.33769012 hartree
cpcmener: -0.02790508 hartree
kineticenergy: 1574.93310587 hartree
xcener: -123.748299393443 hartree
chargesum: -0.0000000
charge: -0.089932 -0.177467 -0.178254 -0.171868 -0.349167 -0.030275 -0.295160 -0.386928 0.222310 0.006077 0.017927 0.058332 -0.107142 -0.155496 -0.164555 -0.086706 -0.122360 -0.254981 0.072446 0.565876 -0.111776 0.086644 -0.122431 0.147575 0.123500 0.092509 0.084898 0.067143 0.061215 0.153099 0.134012 0.181539 0.077011 0.074606 0.094310 0.163798 0.149709 0.169960
qa: -0.0899 -0.1775 -0.1783 -0.1719 -0.3492 -0.0303 -0.2952 -0.3869 0.2223 0.0061 0.0179 0.0583 -0.1071 -0.1555 -0.1646 -0.0867 -0.1224 -0.2550 0.0724 0.5659 -0.1118 0.0866 -0.1224 0.1476 0.1235 0.0925 0.0849 0.0671 0.0612 0.1531 0.1340 0.1815 0.0770 0.0746 0.0943 0.1638 0.1497 0.1700
va: 1.2134 1.1205 1.1249 1.1245 1.9377 3.3220 3.0192 3.1109 3.9346 3.9602 3.8879 4.0021 3.9360 3.8386 3.9955 3.9854 3.9079 3.9155 4.0559 4.4058 3.9829 3.8442 4.0440 0.9854 0.9989 0.9975 0.9919 1.0123 1.0122 1.0013 1.0247 1.0053 1.0144 1.0039 1.0047 1.0006 1.0010 0.9990
dispcorr: -0.018698273 hartree
energy: -1579.986647204200
dipole: 31.15629 -32.12531 -0.96902 17.85496 -16.03415 1.82081 4.47094 -3.13366 1.33728
magnitude: 2.45818 au
magnitude: 6.24821 debye
