program: Orca
programVersion: 4.2.1
elementType: Cl F F F O N N N C C C C C C C C C C C C C C C H H H H H H H H H H H H H H H
charge: 0
multiplicity: 1
keywords: wb97x-d3
keywords: def2-TZVPP
keywords: def2/J RIJCOSX GRIDX6 NOFINALGRIDX
keywords: grid4 nofinalgrid
keywords: scfconv7
keywords: smallprint printgap noloewdin
keywords: NOSOSCF
formula: C15H15ClF3N3O
InChI: InChI=1/C15H15ClF3N3O/c1-2-7-23-9-14(22-6-5-20-10-22)21-13-4-3-11(16)8-12(13)15(17,18)19/h3-6,8,10H,2,7,9H2,1H3
38 atoms
Cl -5.082904 1.326185 0.748552
F  -1.98294 -1.024732 -2.632157
F  -0.014388 -0.478594 -1.968783
F  -0.835138 -2.395969 -1.445553
O  2.332849 1.094155 -0.621977
N  2.526426 -1.281204 0.835882
N  0.260874 -1.166234 0.900814
N  4.663591 -1.773727 1.0773
C  1.349017 -0.538336 0.7569
C  1.512171 0.936517 0.504817
C  2.199739 2.347583 -1.266514
C  -0.97369 -0.528173 0.833207
C  2.737581 3.523229 -0.469095
C  -1.720861 -0.509524 -0.350176
C  -1.525939 0.028063 1.983624
C  -2.984617 0.064735 -0.374272
C  2.617237 -2.658796 0.807829
C  2.680036 4.80115 -1.293541
C  3.80028 -0.809502 1.001036
C  -1.142757 -1.10317 -1.597912
C  -2.785135 0.599208 1.964783
C  -3.50671 0.614055 0.78297
C  3.934585 -2.93416 0.94975
H  1.930949 1.405833 1.404326
H  0.524206 1.382504 0.351575
H  1.148218 2.525389 -1.529455
H  2.754532 2.253314 -2.202309
H  2.16058 3.658837 0.44974
H  3.768929 3.318292 -0.171093
H  -0.962102 0.005096 2.906332
H  -3.564318 0.089916 -1.28591
H  1.757869 -3.291022 0.67521
H  3.284315 4.717011 -2.198187
H  1.658715 5.034203 -1.599397
H  3.053755 5.652907 -0.726403
H  4.036424 0.238458 1.076684
H  -3.194715 1.028516 2.868662
H  4.405107 -3.903774 0.965689
elementType: Cl F O N C H
totalener: -1579.96702212 hartree
nucrepener: 2147.66906758 hartree
electener: -3727.63608970 hartree
oneelecener: -6437.24987760 hartree
twoeener: 2709.61378789 hartree
cpcmener: -0.02884807 hartree
kineticenergy: 1574.92675048 hartree
xcener: -123.748448327711 hartree
chargesum: 0.0000000
charge: -0.090082 -0.177589 -0.175863 -0.176904 -0.369196 -0.028625 -0.295674 -0.385390 0.222536 -0.002542 0.020173 0.066318 -0.079385 -0.159835 -0.163766 -0.083833 -0.121316 -0.280788 0.068261 0.562775 -0.109660 0.085243 -0.121971 0.153342 0.127418 0.074514 0.097491 0.067004 0.062603 0.152814 0.133985 0.180597 0.084328 0.083412 0.094499 0.165720 0.149313 0.170077
qa: -0.0901 -0.1776 -0.1759 -0.1769 -0.3692 -0.0286 -0.2957 -0.3854 0.2225 -0.0025 0.0202 0.0663 -0.0794 -0.1598 -0.1638 -0.0838 -0.1213 -0.2808 0.0683 0.5628 -0.1097 0.0852 -0.1220 0.1533 0.1274 0.0745 0.0975 0.0670 0.0626 0.1528 0.1340 0.1806 0.0843 0.0834 0.0945 0.1657 0.1493 0.1701
va: 1.2131 1.1262 1.1175 1.1210 1.9307 3.3279 3.0180 3.1134 3.9626 3.9559 3.9160 3.9895 3.8464 3.8428 3.9924 3.9840 3.9079 3.9524 4.0573 4.4104 3.9833 3.8458 4.0432 0.9805 0.9917 0.9992 0.9974 1.0097 1.0126 1.0014 1.0242 1.0056 1.0009 1.0013 1.0020 1.0020 1.0011 0.9989
dispcorr: -0.018455743 hartree
energy: -1579.985477862061
dipole: 30.73375 -31.69025 -0.95650 24.40231 -22.26001 2.14230 5.73129 -4.77372 0.95757
magnitude: 2.53403 au
magnitude: 6.44099 debye
