program: Orca
programVersion: 4.2.1
elementType: Cl F F F O N N N C C C C C C C C C C C C C C C H H H H H H H H H H H H H H H
charge: 0
multiplicity: 1
keywords: wb97x-d3
keywords: def2-TZVPP
keywords: def2/J RIJCOSX GRIDX6 NOFINALGRIDX
keywords: grid4 nofinalgrid
keywords: scfconv7
keywords: smallprint printgap noloewdin
keywords: NOSOSCF
formula: C15H15ClF3N3O
InChI: InChI=1/C15H15ClF3N3O/c1-2-7-23-9-14(22-6-5-20-10-22)21-13-4-3-11(16)8-12(13)15(17,18)19/h3-6,8,10H,2,7,9H2,1H3
38 atoms
Cl -5.116292 1.49951 -0.349166
F  -1.093007 -3.007094 -0.183093
F  -0.494355 -1.891774 1.554819
F  -2.513126 -2.600703 1.373615
O  2.210897 1.701987 0.661282
N  2.579353 -0.85777 -0.566501
N  0.35037 -0.627191 -0.952399
N  4.04993 -2.099221 -1.648109
C  1.343909 -0.290062 -0.246831
C  1.333449 0.644147 0.932508
C  2.418554 2.532278 1.791518
C  -0.920185 -0.09957 -0.74343
C  3.492887 3.550333 1.483449
C  -1.878867 -0.794521 0.002848
C  -1.285007 1.094398 -1.359003
C  -3.168791 -0.297276 0.126561
C  3.771735 -0.751166 0.125888
C  3.161152 4.469458 0.317768
C  2.821212 -1.687435 -1.627784
C  -1.500361 -2.073825 0.682837
C  -2.569513 1.592776 -1.238915
C  -3.504649 0.890625 -0.497231
C  4.65284 -1.520541 -0.554398
H  1.635245 0.083261 1.828561
H  0.313441 1.000156 1.112255
H  2.718969 1.922254 2.653588
H  1.481708 3.036335 2.064708
H  3.635782 4.142175 2.390641
H  4.440337 3.03596 1.301922
H  -0.555079 1.633766 -1.947207
H  -3.913479 -0.82525 0.704949
H  3.893472 -0.166819 1.019332
H  3.090383 3.925856 -0.62437
H  2.212112 4.985206 0.476385
H  3.931383 5.231414 0.195626
H  2.05679 -1.943627 -2.341506
H  -2.832654 2.522621 -1.723651
H  5.690605 -1.691826 -0.319367
elementType: Cl F O N C H
totalener: -1579.96822186 hartree
nucrepener: 2130.03475005 hartree
electener: -3710.00297191 hartree
oneelecener: -6401.85830003 hartree
twoeener: 2691.85532812 hartree
cpcmener: -0.02712819 hartree
kineticenergy: 1574.92264770 hartree
xcener: -123.746808613381 hartree
chargesum: -0.0000000
charge: -0.089208 -0.176108 -0.181549 -0.176457 -0.372950 -0.029563 -0.302948 -0.383581 0.253020 -0.002871 0.008918 0.042625 -0.100752 -0.138187 -0.165374 -0.085019 -0.122640 -0.257434 0.069923 0.562241 -0.107963 0.084095 -0.126088 0.138005 0.131312 0.096401 0.095756 0.067492 0.061148 0.154478 0.133659 0.182269 0.079076 0.077887 0.092662 0.166418 0.150088 0.171217
qa: -0.0892 -0.1761 -0.1815 -0.1765 -0.3730 -0.0296 -0.3029 -0.3836 0.2530 -0.0029 0.0089 0.0426 -0.1008 -0.1382 -0.1654 -0.0850 -0.1226 -0.2574 0.0699 0.5622 -0.1080 0.0841 -0.1261 0.1380 0.1313 0.0964 0.0958 0.0675 0.0611 0.1545 0.1337 0.1823 0.0791 0.0779 0.0927 0.1664 0.1501 0.1712
va: 1.2139 1.1232 1.1121 1.1281 1.9193 3.3418 2.9948 3.1144 3.8734 3.9543 3.8808 4.0201 3.9257 3.8249 3.9861 3.9837 3.9246 3.9165 4.0187 4.4193 3.9856 3.8500 4.0348 0.9881 0.9991 0.9958 0.9932 1.0120 1.0122 1.0010 1.0245 0.9912 1.0113 1.0027 1.0043 1.0137 1.0010 0.9990
dispcorr: -0.018113285 hartree
energy: -1579.986335149873
dipole: 36.81849 -36.98266 -0.16417 30.11221 -27.73590 2.37630 4.19740 -2.47622 1.72119
magnitude: 2.93875 au
magnitude: 7.46970 debye
